{"text_format":"1","workbook":"xlsx","n_sheets":4,"sheets":["Splash","Monte Carlo Simulator","Instruction & Quotations","Credits"],"not_rendered":{"charts":2,"images":17,"macros":1,"external_links":0,"defined_names":4,"comments":1,"pivot_tables":0},"unopened":[],"bounds":{"document_bytes":16777216,"sheet_cells":100000,"rows_first":2000,"rows_last":500,"rows_between":2000,"halvings":0,"cell_chars":16384,"cell_head_chars":4096},"cells_cut":0,"cells_raw":0,"read":"whole","date_system":"1900"}

{"sheet":"Splash","index":0,"n_rows":7,"n_cols":12,"rows_kept":7,"cut":false,"hidden":false,"merged":[[6,11,8,17]]}
[]
[]
[]
[]
[]
[]
[null,null,null,null,null,null,null,null,null,null,null,"DayTradingLife.com"]

{"sheet":"Monte Carlo Simulator","index":1,"n_rows":524,"n_cols":39,"rows_kept":524,"cut":false,"hidden":false,"merged":[[1,37,1,39],[1,31,1,35],[1,26,1,29],[13,3,13,4],[17,3,17,4],[14,3,14,4],[19,3,19,4],[15,3,16,4],[15,5,16,5],[12,2,12,5],[519,5,519,6],[520,5,520,6],[521,5,521,6],[502,5,502,6],[503,5,503,6],[504,5,504,6],[505,5,505,6],[506,5,506,6],[507,5,507,6],[508,5,508,6],[509,5,509,6],[510,5,510,6],[511,5,511,6],[512,5,512,6],[513,5,513,6],[514,5,514,6],[515,5,515,6],[516,5,516,6],[517,5,517,6],[518,5,518,6],[485,5,485,6],[486,5,486,6],[487,5,487,6],[488,5,488,6],[489,5,489,6],[490,5,490,6],[491,5,491,6],[492,5,492,6],[493,5,493,6],[494,5,494,6],[495,5,495,6],[496,5,496,6],[497,5,497,6],[498,5,498,6],[499,5,499,6],[500,5,500,6],[501,5,501,6],[468,5,468,6],[469,5,469,6],[470,5,470,6],[471,5,471,6],[472,5,472,6],[473,5,473,6],[474,5,474,6],[475,5,475,6],[476,5,476,6],[477,5,477,6],[478,5,478,6],[479,5,479,6],[480,5,480,6],[481,5,481,6],[482,5,482,6],[483,5,483,6],[447,5,447,6],[448,5,448,6],[449,5,449,6],[450,5,450,6],[484,5,484,6],[451,5,451,6],[452,5,452,6],[453,5,453,6],[454,5,454,6],[455,5,455,6],[456,5,456,6],[457,5,457,6],[458,5,458,6],[459,5,459,6],[460,5,460,6],[461,5,461,6],[462,5,462,6],[463,5,463,6],[464,5,464,6],[465,5,465,6],[466,5,466,6],[467,5,467,6],[430,5,430,6],[431,5,431,6],[432,5,432,6],[433,5,433,6],[434,5,434,6],[435,5,435,6],[436,5,436,6],[437,5,437,6],[438,5,438,6],[439,5,439,6],[440,5,440,6],[441,5,441,6],[442,5,442,6],[443,5,443,6],[444,5,444,6],[445,5,445,6],[446,5,446,6],[413,5,413,6],[414,5,414,6],[415,5,415,6],[416,5,416,6],[417,5,417,6],[418,5,418,6],[419,5,419,6],[420,5,420,6],[421,5,421,6],[422,5,422,6],[423,5,423,6],[424,5,424,6],[425,5,425,6],[426,5,426,6],[427,5,427,6],[428,5,428,6],[429,5,429,6],[396,5,396,6],[397,5,397,6],[398,5,398,6],[399,5,399,6],[400,5,400,6],[401,5,401,6],[402,5,402,6],[403,5,403,6],[404,5,404,6],[405,5,405,6],[406,5,406,6],[407,5,407,6],[408,5,408,6],[409,5,409,6],[410,5,410,6],[411,5,411,6],[412,5,412,6],[379,5,379,6],[380,5,380,6],[381,5,381,6],[382,5,382,6],[383,5,383,6],[384,5,384,6],[385,5,385,6],[386,5,386,6],[387,5,387,6],[388,5,388,6],[389,5,389,6],[390,5,390,6],[391,5,391,6],[392,5,392,6],[393,5,393,6],[394,5,394,6],[395,5,395,6],[362,5,362,6],[363,5,363,6],[364,5,364,6],[365,5,365,6],[366,5,366,6],[367,5,367,6],[368,5,368,6],[369,5,369,6],[370,5,370,6],[371,5,371,6],[372,5,372,6],[373,5,373,6],[374,5,374,6],[375,5,375,6],[376,5,376,6],[377,5,377,6],[378,5,378,6],[345,5,345,6],[346,5,346,6],[347,5,347,6],[348,5,348,6],[349,5,349,6],[350,5,350,6],[351,5,351,6],[352,5,352,6],[353,5,353,6],[354,5,354,6],[355,5,355,6],[356,5,356,6],[357,5,357,6],[358,5,358,6],[359,5,359,6],[360,5,360,6],[361,5,361,6],[328,5,328,6],[329,5,329,6],[330,5,330,6],[331,5,331,6],[332,5,332,6],[333,5,333,6],[334,5,334,6],[335,5,335,6],[336,5,336,6],[337,5,337,6],[338,5,338,6],[339,5,339,6],[340,5,340,6],[341,5,341,6],[342,5,342,6],[343,5,343,6],[344,5,344,6],[311,5,311,6],[312,5,312,6],[313,5,313,6],[314,5,314,6],[315,5,315,6],[316,5,316,6],[317,5,317,6],[318,5,318,6],[319,5,319,6],[320,5,320,6],[321,5,321,6],[322,5,322,6],[323,5,323,6],[324,5,324,6],[325,5,325,6],[326,5,326,6],[327,5,327,6],[294,5,294,6],[295,5,295,6],[296,5,296,6],[297,5,297,6],[298,5,298,6],[299,5,299,6],[300,5,300,6],[301,5,301,6],[302,5,302,6],[303,5,303,6],[304,5,304,6],[305,5,305,6],[306,5,306,6],[307,5,307,6],[308,5,308,6],[309,5,309,6],[310,5,310,6],[277,5,277,6],[278,5,278,6],[279,5,279,6],[280,5,280,6],[281,5,281,6],[282,5,282,6],[283,5,283,6],[284,5,284,6],[285,5,285,6],[286,5,286,6],[287,5,287,6],[288,5,288,6],[289,5,289,6],[290,5,290,6],[291,5,291,6],[292,5,292,6],[293,5,293,6],[260,5,260,6],[261,5,261,6],[262,5,262,6],[263,5,263,6],[264,5,264,6],[265,5,265,6],[266,5,266,6],[267,5,267,6],[268,5,268,6],[269,5,269,6],[270,5,270,6],[271,5,271,6],[272,5,272,6],[273,5,273,6],[274,5,274,6],[275,5,275,6],[276,5,276,6],[243,5,243,6],[244,5,244,6],[245,5,245,6],[246,5,246,6],[247,5,247,6],[248,5,248,6],[249,5,249,6],[250,5,250,6],[251,5,251,6],[252,5,252,6],[253,5,253,6],[254,5,254,6],[255,5,255,6],[256,5,256,6],[257,5,257,6],[258,5,258,6],[259,5,259,6],[226,5,226,6],[227,5,227,6],[228,5,228,6],[229,5,229,6],[230,5,230,6],[231,5,231,6],[232,5,232,6],[233,5,233,6],[234,5,234,6],[235,5,235,6],[236,5,236,6],[237,5,237,6],[238,5,238,6],[239,5,239,6],[240,5,240,6],[241,5,241,6],[242,5,242,6],[209,5,209,6],[210,5,210,6],[211,5,211,6],[212,5,212,6],[213,5,213,6],[214,5,214,6],[215,5,215,6],[216,5,216,6],[217,5,217,6],[218,5,218,6],[219,5,219,6],[220,5,220,6],[221,5,221,6],[222,5,222,6],[223,5,223,6],[224,5,224,6],[225,5,225,6],[192,5,192,6],[193,5,193,6],[194,5,194,6],[195,5,195,6],[196,5,196,6],[197,5,197,6],[198,5,198,6],[199,5,199,6],[200,5,200,6],[201,5,201,6],[202,5,202,6],[203,5,203,6],[204,5,204,6],[205,5,205,6],[206,5,206,6],[207,5,207,6],[208,5,208,6],[175,5,175,6],[176,5,176,6],[177,5,177,6],[178,5,178,6],[179,5,179,6],[180,5,180,6],[181,5,181,6],[182,5,182,6],[183,5,183,6],[184,5,184,6],[185,5,185,6],[186,5,186,6],[187,5,187,6],[188,5,188,6],[189,5,189,6],[190,5,190,6],[191,5,191,6],[158,5,158,6],[159,5,159,6],[160,5,160,6],[161,5,161,6],[162,5,162,6],[163,5,163,6],[164,5,164,6],[165,5,165,6],[166,5,166,6],[167,5,167,6],[168,5,168,6],[169,5,169,6],[170,5,170,6],[171,5,171,6],[172,5,172,6],[173,5,173,6],[174,5,174,6],[141,5,141,6],[142,5,142,6],[143,5,143,6],[144,5,144,6],[145,5,145,6],[146,5,146,6],[147,5,147,6],[148,5,148,6],[149,5,149,6],[150,5,150,6],[151,5,151,6],[152,5,152,6],[153,5,153,6],[154,5,154,6],[155,5,155,6],[156,5,156,6],[157,5,157,6],[124,5,124,6],[125,5,125,6],[126,5,126,6],[127,5,127,6],[128,5,128,6],[129,5,129,6],[130,5,130,6],[131,5,131,6],[132,5,132,6],[133,5,133,6],[134,5,134,6],[135,5,135,6],[136,5,136,6],[137,5,137,6],[138,5,138,6],[139,5,139,6],[140,5,140,6],[107,5,107,6],[108,5,108,6],[109,5,109,6],[110,5,110,6],[111,5,111,6],[112,5,112,6],[113,5,113,6],[114,5,114,6],[115,5,115,6],[116,5,116,6],[117,5,117,6],[118,5,118,6],[119,5,119,6],[120,5,120,6],[121,5,121,6],[122,5,122,6],[123,5,123,6],[90,5,90,6],[91,5,91,6],[92,5,92,6],[93,5,93,6],[94,5,94,6],[95,5,95,6],[96,5,96,6],[97,5,97,6],[98,5,98,6],[99,5,99,6],[100,5,100,6],[101,5,101,6],[102,5,102,6],[103,5,103,6],[104,5,104,6],[105,5,105,6],[106,5,106,6],[73,5,73,6],[74,5,74,6],[75,5,75,6],[76,5,76,6],[77,5,77,6],[78,5,78,6],[79,5,79,6],[80,5,80,6],[81,5,81,6],[82,5,82,6],[83,5,83,6],[84,5,84,6],[85,5,85,6],[86,5,86,6],[87,5,87,6],[88,5,88,6],[89,5,89,6],[3,2,3,5],[4,25,4,26],[5,25,5,26],[6,25,6,26],[7,25,7,26],[4,27,4,28],[4,2,4,3],[5,11,5,12],[11,9,12,10],[23,5,23,6],[24,5,24,6],[129,7,129,9],[130,7,130,9],[131,7,131,9],[132,7,132,9],[40,5,40,6],[41,5,41,6],[42,5,42,6],[43,5,43,6],[60,5,60,6],[61,5,61,6],[62,5,62,6],[63,5,63,6],[64,5,64,6],[65,5,65,6],[66,5,66,6],[67,5,67,6],[68,5,68,6],[69,5,69,6],[70,5,70,6],[71,5,71,6],[72,5,72,6],[516,7,516,9],[510,7,510,9],[511,7,511,9],[517,7,517,9],[518,7,518,9],[434,7,434,9],[512,7,512,9],[8,27,8,28],[431,7,431,9],[430,7,430,9],[383,7,383,9],[384,7,384,9],[385,7,385,9],[386,7,386,9],[387,7,387,9],[388,7,388,9],[389,7,389,9],[390,7,390,9],[391,7,391,9],[392,7,392,9],[393,7,393,9],[394,7,394,9],[395,7,395,9],[396,7,396,9],[506,7,506,9],[507,7,507,9],[508,7,508,9],[509,7,509,9],[513,7,513,9],[514,7,514,9],[515,7,515,9],[456,7,456,9],[500,7,500,9],[501,7,501,9],[502,7,502,9],[503,7,503,9],[504,7,504,9],[505,7,505,9],[437,7,437,9],[438,7,438,9],[439,7,439,9],[440,7,440,9],[441,7,441,9],[442,7,442,9],[443,7,443,9],[444,7,444,9],[445,7,445,9],[446,7,446,9],[447,7,447,9],[448,7,448,9],[449,7,449,9],[450,7,450,9],[480,7,480,9],[482,7,482,9],[485,7,485,9],[486,7,486,9],[487,7,487,9],[488,7,488,9],[471,7,471,9],[483,7,483,9],[484,7,484,9],[495,7,495,9],[1,8,1,25],[413,7,413,9],[414,7,414,9],[415,7,415,9],[379,7,379,9],[130,25,130,39],[131,25,131,39],[496,7,496,9],[497,7,497,9],[132,25,132,39],[133,26,133,32],[134,25,134,39],[14,11,14,12],[14,9,14,10],[13,9,13,10],[14,25,14,26],[13,25,13,26],[11,25,12,26],[19,11,19,12],[17,27,17,28],[10,11,10,12],[3,32,3,37],[432,7,432,9],[433,7,433,9],[427,7,427,9],[428,7,428,9],[380,7,380,9],[381,7,381,9],[382,7,382,9],[429,7,429,9],[416,7,416,9],[397,7,397,9],[520,7,520,9],[465,7,465,9],[466,7,466,9],[467,7,467,9],[468,7,468,9],[469,7,469,9],[470,7,470,9],[519,7,519,9],[472,7,472,9],[473,7,473,9],[474,7,474,9],[475,7,475,9],[476,7,476,9],[477,7,477,9],[478,7,478,9],[479,7,479,9],[451,7,451,9],[452,7,452,9],[453,7,453,9],[454,7,454,9],[455,7,455,9],[457,7,457,9],[458,7,458,9],[459,7,459,9],[460,7,460,9],[461,7,461,9],[464,7,464,9],[462,7,462,9],[463,7,463,9],[481,7,481,9],[498,7,498,9],[499,7,499,9],[400,7,400,9],[401,7,401,9],[402,7,402,9],[403,7,403,9],[404,7,404,9],[405,7,405,9],[406,7,406,9],[407,7,407,9],[408,7,408,9],[409,7,409,9],[410,7,410,9],[411,7,411,9],[412,7,412,9],[426,7,426,9],[422,7,422,9],[423,7,423,9],[424,7,424,9],[425,7,425,9],[417,7,417,9],[418,7,418,9],[419,7,419,9],[420,7,420,9],[421,7,421,9],[350,7,350,9],[351,7,351,9],[352,7,352,9],[353,7,353,9],[354,7,354,9],[355,7,355,9],[356,7,356,9],[357,7,357,9],[358,7,358,9],[359,7,359,9],[360,7,360,9],[361,7,361,9],[362,7,362,9],[398,7,398,9],[399,7,399,9],[363,7,363,9],[364,7,364,9],[365,7,365,9],[366,7,366,9],[367,7,367,9],[368,7,368,9],[369,7,369,9],[370,7,370,9],[371,7,371,9],[372,7,372,9],[373,7,373,9],[374,7,374,9],[375,7,375,9],[376,7,376,9],[377,7,377,9],[378,7,378,9],[333,7,333,9],[334,7,334,9],[335,7,335,9],[336,7,336,9],[337,7,337,9],[338,7,338,9],[339,7,339,9],[340,7,340,9],[341,7,341,9],[342,7,342,9],[343,7,343,9],[344,7,344,9],[345,7,345,9],[346,7,346,9],[347,7,347,9],[348,7,348,9],[349,7,349,9],[316,7,316,9],[317,7,317,9],[318,7,318,9],[319,7,319,9],[320,7,320,9],[321,7,321,9],[322,7,322,9],[323,7,323,9],[324,7,324,9],[325,7,325,9],[326,7,326,9],[327,7,327,9],[328,7,328,9],[329,7,329,9],[330,7,330,9],[331,7,331,9],[332,7,332,9],[299,7,299,9],[300,7,300,9],[301,7,301,9],[302,7,302,9],[303,7,303,9],[304,7,304,9],[305,7,305,9],[306,7,306,9],[307,7,307,9],[308,7,308,9],[309,7,309,9],[310,7,310,9],[311,7,311,9],[312,7,312,9],[313,7,313,9],[314,7,314,9],[315,7,315,9],[282,7,282,9],[283,7,283,9],[284,7,284,9],[285,7,285,9],[286,7,286,9],[287,7,287,9],[288,7,288,9],[289,7,289,9],[290,7,290,9],[291,7,291,9],[292,7,292,9],[293,7,293,9],[294,7,294,9],[295,7,295,9],[296,7,296,9],[297,7,297,9],[298,7,298,9],[265,7,265,9],[266,7,266,9],[267,7,267,9],[268,7,268,9],[269,7,269,9],[270,7,270,9],[271,7,271,9],[272,7,272,9],[273,7,273,9],[274,7,274,9],[275,7,275,9],[276,7,276,9],[277,7,277,9],[278,7,278,9],[279,7,279,9],[280,7,280,9],[281,7,281,9],[248,7,248,9],[249,7,249,9],[250,7,250,9],[251,7,251,9],[252,7,252,9],[253,7,253,9],[254,7,254,9],[255,7,255,9],[256,7,256,9],[257,7,257,9],[258,7,258,9],[259,7,259,9],[260,7,260,9],[261,7,261,9],[262,7,262,9],[263,7,263,9],[264,7,264,9],[231,7,231,9],[232,7,232,9],[233,7,233,9],[234,7,234,9],[235,7,235,9],[236,7,236,9],[237,7,237,9],[238,7,238,9],[239,7,239,9],[240,7,240,9],[241,7,241,9],[242,7,242,9],[243,7,243,9],[244,7,244,9],[245,7,245,9],[246,7,246,9],[247,7,247,9],[214,7,214,9],[215,7,215,9],[216,7,216,9],[217,7,217,9],[218,7,218,9],[219,7,219,9],[220,7,220,9],[221,7,221,9],[222,7,222,9],[223,7,223,9],[224,7,224,9],[225,7,225,9],[226,7,226,9],[227,7,227,9],[228,7,228,9],[229,7,229,9],[230,7,230,9],[197,7,197,9],[198,7,198,9],[199,7,199,9],[200,7,200,9],[201,7,201,9],[202,7,202,9],[203,7,203,9],[204,7,204,9],[205,7,205,9],[206,7,206,9],[207,7,207,9],[208,7,208,9],[209,7,209,9],[210,7,210,9],[211,7,211,9],[212,7,212,9],[213,7,213,9],[180,7,180,9],[181,7,181,9],[182,7,182,9],[183,7,183,9],[184,7,184,9],[185,7,185,9],[186,7,186,9],[187,7,187,9],[188,7,188,9],[189,7,189,9],[190,7,190,9],[191,7,191,9],[192,7,192,9],[193,7,193,9],[194,7,194,9],[195,7,195,9],[196,7,196,9],[163,7,163,9],[164,7,164,9],[165,7,165,9],[166,7,166,9],[167,7,167,9],[168,7,168,9],[169,7,169,9],[170,7,170,9],[171,7,171,9],[172,7,172,9],[173,7,173,9],[174,7,174,9],[175,7,175,9],[176,7,176,9],[177,7,177,9],[178,7,178,9],[179,7,179,9],[146,7,146,9],[147,7,147,9],[148,7,148,9],[149,7,149,9],[150,7,150,9],[151,7,151,9],[152,7,152,9],[153,7,153,9],[154,7,154,9],[155,7,155,9],[156,7,156,9],[157,7,157,9],[158,7,158,9],[159,7,159,9],[160,7,160,9],[161,7,161,9],[162,7,162,9],[144,7,144,9],[145,7,145,9],[112,7,112,9],[113,7,113,9],[114,7,114,9],[115,7,115,9],[116,7,116,9],[117,7,117,9],[118,7,118,9],[119,7,119,9],[120,7,120,9],[121,7,121,9],[122,7,122,9],[123,7,123,9],[124,7,124,9],[125,7,125,9],[126,7,126,9],[127,7,127,9],[128,7,128,9],[106,7,106,9],[107,7,107,9],[108,7,108,9],[109,7,109,9],[110,7,110,9],[111,7,111,9],[133,7,133,9],[134,7,134,9],[135,7,135,9],[136,7,136,9],[137,7,137,9],[138,7,138,9],[139,7,139,9],[140,7,140,9],[141,7,141,9],[142,7,142,9],[143,7,143,9],[89,7,89,9],[90,7,90,9],[91,7,91,9],[92,7,92,9],[93,7,93,9],[94,7,94,9],[95,7,95,9],[96,7,96,9],[97,7,97,9],[98,7,98,9],[99,7,99,9],[100,7,100,9],[101,7,101,9],[102,7,102,9],[103,7,103,9],[104,7,104,9],[105,7,105,9],[513,3,513,4],[514,3,514,4],[515,3,515,4],[516,3,516,4],[517,3,517,4],[518,3,518,4],[519,3,519,4],[520,3,520,4],[521,3,521,4],[522,3,522,4],[23,7,23,9],[24,7,24,9],[25,7,25,9],[26,7,26,9],[27,7,27,9],[28,7,28,9],[29,7,29,9],[30,7,30,9],[31,7,31,9],[32,7,32,9],[33,7,33,9],[34,7,34,9],[35,7,35,9],[36,7,36,9],[37,7,37,9],[38,7,38,9],[39,7,39,9],[47,7,47,9],[48,7,48,9],[49,7,49,9],[50,7,50,9],[60,7,60,9],[496,3,496,4],[497,3,497,4],[498,3,498,4],[499,3,499,4],[500,3,500,4],[501,3,501,4],[502,3,502,4],[503,3,503,4],[504,3,504,4],[505,3,505,4],[506,3,506,4],[507,3,507,4],[508,3,508,4],[509,3,509,4],[510,3,510,4],[511,3,511,4],[512,3,512,4],[479,3,479,4],[480,3,480,4],[481,3,481,4],[482,3,482,4],[483,3,483,4],[484,3,484,4],[485,3,485,4],[486,3,486,4],[487,3,487,4],[488,3,488,4],[489,3,489,4],[490,3,490,4],[491,3,491,4],[492,3,492,4],[493,3,493,4],[494,3,494,4],[495,3,495,4],[462,3,462,4],[463,3,463,4],[464,3,464,4],[465,3,465,4],[466,3,466,4],[467,3,467,4]],"merged_total":2094,"flags":["merged_cut"]}
[]
[null,"Details",null,null,null,null,null,null,"Trade System Expectancy - 'Monte Carlo'  Simulator v1.01",null,null,null,null,null,null,null,null,null,null,null,null,null,null,null,null,null,"DayTradingLife.com.",null,null,null,null,"traderdowboy@gmail.com",null,null,null,null,"Current Date / Time:",{"$f":"TEXT(NOW(),\"dd/mm/yyyy   hh:mm AM/PM\")","v":"10/05/2012   08:19 PM"}]
[]
[null,null,"1st: ENTER DETAILS IN YELLOW CELLS!",null,null,null,null,null,null,"Results After  500  Random Trades.",null,null,null,null,null,null,null,null,null,null,null,null,null,null,null,null,null,null,null,null,null,null,"Results After 100 Simulated Trades"]
[null,null,"NOTES",null,"CALCULATE",null,null,null,null,"Total Losing Trades",null,{"$f":"IF(COUNTA($F$6:$F$10)=5,COUNTIF($L$24:$L$523,\"LOSS\"),\"\")","v":228},null,null,null,null,null,null,null,null,null,null,null,null,null,"Total Winning Trades",null,{"$f":"IF(COUNTA($F$6:$F$10)=5,COUNTIF($L$24:$L$523,\"WIN\"),\"\")","v":272},null,null,null,null,"Total Losing Trades",{"$f":"IF(COUNTA($F$6:$F$10)=5,COUNTIF($L$24:$L$123,\"LOSS\"),\"\")","v":43},null,null,"Total Winning Trades",{"$f":"IF(COUNTA($F$6:$F$10)=5,COUNTIF($L$24:$L$123,\"WIN\"),\"\")","v":57}]
[null,null,"Starting Capital (£)",null,null,10000,null,null,null,"Total Losses(£)",null,{"$f":"IF(COUNTA($F$6:$F$10)=5,SUMPRODUCT((L24:L523=\"LOSS\")*((F25:F524)-(F24:F523)))-F10,\"\")","v":-42083.76197795973},null,null,null,null,null,null,null,null,null,null,null,null,null,"Total Wins(£)",null,{"$f":"IF(COUNTA($F$6:$F$10)=5,SUMPRODUCT((L24:L523=\"WIN\")*((F25:F524)-(F24:F523)))-F10,\"\")","v":58021.00249426387},null,null,null,null,"Total Losses(£)",{"$f":"IF(COUNTA($F$6:$F$10)=5,SUMPRODUCT((L24:L123=\"LOSS\")*((F25:F124)-(F24:F123)))-F10,\"\")","v":-5114.5997798382905},null,null,"Total Wins(£)",{"$f":"IF(COUNTA($F$6:$F$10)=5,SUMPRODUCT((L24:L123=\"WIN\")*((F25:F124)-(F24:F123)))-F10,\"\")","v":7926.1764638380428}]
[null,null,"Risk (%)",null,null,0.01,null,null,null,"Actual Losing(%)",null,{"$f":"IF(COUNTA($F$6:$F$10)=5,L5/(L5+AB5),\"\")","v":0.45600000000000002},null,null,null,null,null,null,null,null,null,null,null,null,null,"Actual Win(%)",null,{"$f":"IF(COUNTA($F$6:$F$10)=5,(COUNTIF($D$24:$D$523,\"<\" & $F$8)/500),\"\")","v":0.54400000000000004},null,null,null,null,"Actual Losing(%)",{"$f":"IF(COUNTA($F$6:$F$10)=5,AH5/(AH5+AL5),\"\")","v":0.43},null,null,"Actual Winning(%)",{"$f":"IF(COUNTA($F$6:$F$10)=5,(COUNTIF($D$24:$D$123,\"<\" & $F$8)/100),\"\")","v":0.56999999999999995}]
[null,null,"Winning  (%)",null,null,55,null,null,null,"Average Trade Loss(£)",null,{"$f":"IF(COUNTA($F$6:$F$10)=5,(L6/L5),\"\")","v":-184.57790341210409},null,null,null,null,null,null,null,null,null,null,null,null,null,"Average Trade Win(£)",null,{"$f":"IF(COUNTA($F$6:$F$10)=5,(AB6/AB5),\"\")","v":213.31250917008776},null,null,null,null,"Average Trade Loss(£)",{"$f":"IF(COUNTA($F$6:$F$10)=5,(AH6/AH5),\"\")","v":-118.94418092647187},null,null,"Average Trade Win(£)",{"$f":"IF(COUNTA($F$6:$F$10)=5,(AL6/AL5),\"\")","v":139.05572743575513}]
[null,null,"Payoff Ratio OR R/R",null,null,1.2,null,null,null,"Average Trade Loss(%)",null,{"$f":"IF(COUNTA($F$6:$F$10)=5,(L8/L6),\"\")","v":4.3859649122807024E-3},null,null,null,null,null,null,null,null,null,null,null,null,null,"Average Trade Win(%)",null,{"$f":"IF(COUNTA($F$6:$F$10)=5,(AB8/AB6),\"\")","v":3.6764705882352941E-3},null,null,null,null,"Average Trade Loss(%)",{"$f":"IF(COUNTA($F$6:$F$10)=5,(AH8/AH6),\"\")","v":2.3255813953488372E-2},null,null,"Average Trade Win(%)",{"$f":"IF(COUNTA($F$6:$F$10)=5,(AL8/AL6),\"\")","v":1.7543859649122806E-2}]
[null,null,"Commission (£)",null,null,0,null,null,null,"Most Consec. Losses",null,{"$f":"IF(COUNTA($F$6:$F$10)=5,MAX(FREQUENCY(IF(L24:L523=\"LOSS\",ROW(L24:L523)),IF(L24:L523<>\"LOSS\",ROW(L24:L523)))),\"\")","v":10},{"$f":"IF(N(L10),ADDRESS(MATCH(L10,COUNTIF(OFFSET(L24:L523,ROW(INDIRECT(\"1:\"&ROWS(L24:L523)-L10+1))-1,0,L10),\"LOSS\"),0)+ROW(L24)-1,COLUMN(L24),4)&\":\"&ADDRESS(MATCH(L10,COUNTIF(OFFSET(L24:L523,ROW(INDIRECT(\"1:\"&ROWS(L24:L523)-L10+1))-1,0,L10),\"LOSS\"),0)+L10-1+ROW(L24)-1,COLUMN(L24),4),\"\")","v":"L420:L429"},null,null,null,null,null,null,null,null,null,null,null,null,"Most Consec. Wins",null,{"$f":"IF(COUNTA($F$6:$F$10)=5,MAX(FREQUENCY(IF(L24:L523=\"WIN\",ROW(L24:L523)),IF(L24:L523<>\"WIN\",ROW(L24:L523)))),\"\")","v":10},{"$f":"IF(N(AB10),ADDRESS(MATCH(AB10,COUNTIF(OFFSET(L24:L523,ROW(INDIRECT(\"1:\"&ROWS(L24:L523)-AB10+1))-1,0,AB10),\"WIN\"),0)+ROW(L24)-1,COLUMN(L24),4)&\":\"&ADDRESS(MATCH(AB10,COUNTIF(OFFSET(L24:L523,ROW(INDIRECT(\"1:\"&ROWS(L24:L523)-AB10+1))-1,0,AB10),\"WIN\"),0)+AB10-1+ROW(L24)-1,COLUMN(L24),4),\"\")","v":"L256:L265"},null,null," ","Most Consec. Losses",{"$f":"IF(COUNTA($F$6:$F$10)=5,MAX(FREQUENCY(IF(L24:L123=\"LOSS\",ROW(L24:L123)),IF(L24:L124<>\"LOSS\",ROW(L24:L123)))),\"\")","v":4},{"$f":"IF(N(AH10),ADDRESS(MATCH(AH10,COUNTIF(OFFSET(L24:L123,ROW(INDIRECT(\"1:\"&ROWS(L24:L123)-AH10+1))-1,0,AH10),\"LOSS\"),0)+ROW(L24)-1,COLUMN(L24),4)&\":\"&ADDRESS(MATCH(AH10,COUNTIF(OFFSET(L24:L123,ROW(INDIRECT(\"1:\"&ROWS(L24:L123)-AH10+1))-1,0,AH10),\"LOSS\"),0)+AH10-1+ROW(L24)-1,COLUMN(L24),4),\"\")","v":"L120:L123"},null,"Most Consec. Wins",{"$f":"IF(COUNTA($F$6:$F$10)=5,MAX(FREQUENCY(IF(L24:L123=\"WIN\",ROW(L24:L123)),IF(L24:L123<>\"WIN\",ROW(L24:L123)))),\"\")","v":6},{"$f":"IF(N(AL10),ADDRESS(MATCH(AL10,COUNTIF(OFFSET(L24:L123,ROW(INDIRECT(\"1:\"&ROWS(L24:L123)-AL10+1))-1,0,AL10),\"WIN\"),0)+ROW(L24)-1,COLUMN(L24),4)&\":\"&ADDRESS(MATCH(AL10,COUNTIF(OFFSET(L24:L123,ROW(INDIRECT(\"1:\"&ROWS(L24:L123)-AL10+1))-1,0,AL10),\"WIN\"),0)+AL10-1+ROW(L24)-1,COLUMN(L24),4),\"\")","v":"L52:L57"}]
[null,null,null,null,null,null,null,null,null,"Most Consec. Losses(£)",null,{"$f":"IF(COUNTA($F$6:$F$10)=5,SUM(OFFSET(INDIRECT(M10),,-1,L10)),\"\")","v":-2350.3738720301303},null,null,null,null,null,null,null,null,null,null,null,null,null,"Most Consec. Wins(£)",null,{"$f":"IF(COUNTA($F$6:$F$10)=5,SUM(OFFSET(INDIRECT(AC10),,-1,AB10)),\"\")","v":2096.3296999463346},null,null,null,null,"Most Consec. Losses(£)",{"$f":"IF(COUNTA($F$6:$F$10)=5,SUM(OFFSET(INDIRECT(AI10),,-1,AH10)),\"\")","v":-525.53543246609922},null,null,"Most Consec. Wins(£)",{"$f":"IF(COUNTA($F$6:$F$10)=5,SUM(OFFSET(INDIRECT(AM10),,-1,AL10)),\"\")","v":778.64430297608124}]
[null,null,null,null,null,null,null,null,null,"Largest Losing Streak(£)",null,{"$f":"IF(COUNTA($F$6:$F$10)=5,MIN(X24:X523),\"\")","v":-2350.3738720301299},null,null,null,null,null,null,null,null,null,null,null,null,null,"Largest Winning Streak(£)",null,{"$f":"IF(COUNTA($F$6:$F$10)=5,MAX(W24:W523),\"\")","v":2096.3296999463309},null,null,null,null,"Largest Losing Streak(£)",{"$f":"IF(COUNTA($F$6:$F$10)=5,MIN(X24:X123),\"\")","v":-525.53543246609934},null,null,"Largest Winning Streak(£)",{"$f":"IF(COUNTA($F$6:$F$10)=5,MAX(W24:W123),\"\")","v":859.83402060153867}]
[null,null,"Statistical Probabilty Of Consec. Wins & Losses."]
[null,null,"No.Trades","Con.Losses",null,"Con. Wins",null,null,null,"Largest Losing Trade(£)",null,{"$f":"IF(M14=\"\",\"\",\"K\"& 23+MATCH(M14,IF(L24:L523=\"LOSS\",K24:K523),0))","v":"K508"},{"$f":"IF(COUNTA($F$6:$F$10)<5, \"\", MIN(IF(L24:L523 = \"LOSS\", K24:K523)))","v":-266.98615952926116},null,null,null,null,null,null,null,null,null,null,null,null,"Largest Winning Trade(£)",null,{"$f":"IF(AC14=\"\",\"\",\"K\"& 23+MATCH(AC14,IF(L24:L523=\"WIN\",K24:K523),0))","v":"K507"},{"$f":"IF(COUNTA($F$6:$F$10)<5, \"\", MAX(IF(L24:L523 = \"WIN\", K24:K523)))","v":316.58437888845191},null,null,null,"Largest Losing Trade(£)",{"$f":"IF(AI14=\"\",\"\",\"K\"& 23+MATCH(AI14,IF(L24:L123=\"LOSS\",K24:K123),0))","v":"K120"},{"$f":"IF(COUNTA($F$6:$F$10)<5, \"\", MIN(IF(L24:L123 = \"LOSS\", K24:K123)))","v":-133.37112116465852},null,"Largest Winning Trade(£)",{"$f":"IF(AM14=\"\",\"\",\"K\"& 23+MATCH(AM14,IF(L24:L123=\"WIN\",K24:K123),0))","v":"K119"},{"$f":"IF(COUNTA($F$6:$F$10)<5, \"\", MAX(IF(L24:L123 = \"WIN\", K24:K123)))","v":158.14757450354765}]
[null,null,null,{"$f":"IF(COUNTA($C$15,$F$8)=2,LN(C15)/-LN(D16),\"\")","v":""},null,{"$f":"IF(COUNTA($C$15,$F$8)=2,LN(C15)/-LN(F16),\"\")","v":""},null,null,null,"Lowest Equity Low(£)",null,{"$f":"IF(COUNTA($F$6:$F$10)=5,MIN($F$24:$F$523),\"\")","v":9819.4258799999989},null,null,null,null,null,null,null,null,null,null,null,null,null,"Peak Gain(£)",null,{"$f":"IF(COUNTA($F$6:$F$10)=5,MAX($F$24:$F$523),\"\")","v":26698.615952926113},null,null,null,null,"Lowest Equity Low(£)",{"$f":"IF(COUNTA($F$6:$F$10)=5,MIN($F$24:$F$123),\"\")","v":9819.4258799999989},null,null,"Peak Gain(£)",{"$f":"IF(COUNTA($F$6:$F$10)=5,MAX($F$24:$F$123),\"\")","v":13337.112116465853}]
[null,null,null,{"$f":"(100-F8)/100","v":0.45},null,{"$f":"1-D16","v":0.55000000000000004}]
[]
[null,null,100,{"$f":"IF(COUNTBLANK($F$6:$F$10),\"\",LN(C18)/-LN(D16))","v":5.7672207892310094},null,{"$f":"IF(COUNTBLANK($F$6:$F$10),\"\",LN(C18)/-LN(F16))","v":7.7030531401828721},null,null,null,"Ending Capital (£)",null,{"$f":"IF(COUNTBLANK($F$6:$F$10),\"\",(F523+K523))","v":25937.240516304133},null,null,null,null,null,null,null,null,null,null,null,null,null,"Nett Profit / Loss (%)",null,{"$f":"IF(COUNTBLANK($F$6:$F$10),\"\",(L18-F6)/F6)","v":1.5937240516304132},null,null,null,null,"Ending Capital (£)",{"$f":"IF(COUNTBLANK($F$6:$F$10),\"\",(F124))","v":12811.576683999752},null,null,"Nett Profit / Loss (%)",{"$f":"IF(COUNTBLANK($F$6:$F$10),\"\",(AH18-F6)/F6)","v":0.28115766839997525}]
[]
[null,null,500,{"$f":"IF(COUNTBLANK($F$6:$F$10),\"\",LN(C20)/-LN(D16))","v":7.7827779592587962},null,{"$f":"IF(COUNTBLANK($F$6:$F$10),\"\",LN(C20)/-LN(F16))","v":10.395154683579973},null,null,null,"Nett Profit / Loss (£)",null,{"$f":"IF(COUNTBLANK($F$6:$F$10),\"\",(L18-F6))","v":15937.240516304133},null,null,null,null,null,null,null,null,null,null,null,null,null,"Drawdown Recovery (%)",null,{"$f":"IF(AND(COUNTBLANK($F$6:$F$10)>0,L18=\"\"),\"\",IF(OR(L18<0,L18>=F6),\"NO % DATA IS REQUIRED\",IF(AND(L18>0,L18<F6),(1/(L18/F6)-1),)))","v":"NO % DATA IS REQUIRED"},null,null,null,null,"Nett Profit / Loss (£)",{"$f":"IF(COUNTBLANK($F$6:$F$10),\"\",(AH18-F6))","v":2811.5766839997523},null,null,"Drawdown Recovery (%)",{"$f":"IF(AND(COUNTBLANK($F$6:$F$10)>0,AH18=\"\"),\"\",IF(OR(AH18<0,AH18>=F6),\"NO % DATA IS REQUIRED\",IF(AND(AH18>0,AH18<F6),(1/(AH18/F6)-1),)))","v":"NO % DATA IS REQUIRED"}]
[]
[]
[null," Row & Trade",null,"Monte Carlo ",null,"Capital (£)",null,{"$f":"IF(COUNTA($F$6:$F$10)=5, CONCATENATE(\"Risk \", F7*100,\"%\"),\"Risk %\")","v":"Risk 1%"},null,null,"Win/Loss (£)","Outcome (L)","Capital +/-%","Count","Position","Repeats","WIN","LOSS","Win Label Pos.","WIN %","LOSS Label Pos","LOSS %","Winning Streaks £'s","Losing Streaks £'s"]
[null,"Row 24 (1)",null,{"$f":"IF(COUNTA($F$6:$F$10)=5,100*RAND(),\"\")","v":59.600615962884497},null,{"$f":"IF(COUNTBLANK($F$6:$F$10),\"\",$F$6)","v":10000},null,{"$f":"IF(COUNTBLANK($F$6:$F$10),\"\",F24*$F$7)","v":100},null,null,{"$f":"IF(COUNTBLANK($F$6:$F$10),\"\", IF(L24=\"win\", H24*$F$9-$F$10, IF(L24=\"loss\", -H24-$F$10)))","v":-100},{"$f":"IF(D24=\"\",\"\",IF(D24<$F$8,\"WIN\",\"LOSS\"))","v":"LOSS"},{"$f":"IF(COUNTA($F$6:$F$10)=5,(F25-F24)/F24,\"\")","v":-0.01},1,{"$f":"IF(N24=1,IF(N25=1,\"last\",\"new\"),IF(N25=1,\"last\",\"middle\"))","v":"last"},25,{"$f":"COUNTIFS(Outcome,$Q$23,position,\"last\",count,P24)","v":0},{"$f":"SUMPRODUCT((Outcome=$R$23)*(position=\"last\")*(count=P24))","v":0},0.5,{"$f":"IF(Q24=0,\"\",Q24*$P24/500)","v":""},{"$f":"S24+1","v":1.5},{"$f":"IF(R24=0,\"\",R24*$P24/500)","v":""},{"$f":"IF(AND(L24=\"WIN\",L25<>\"WIN\"),SUMIF(L24:L$24,\"WIN\",K24:K$24)-SUM(W$23:W23),\"\")","v":""},{"$f":"IF(AND(L24=\"LOSS\",L25<>\"LOSS\"),SUMIF(L$24:L24,\"LOSS\",K$24:K24)-SUM(X$23:X23),\"\")","v":-100}]
[null,"Row 25 (2)",null,{"$f":"IF(COUNTA($F$6:$F$10)=5,100*RAND(),\"\")","v":18.879381613179223},null,{"$f":"IF(COUNTBLANK($F$6:$F$10),\"\",IF(D24<$F$8,(1+$F$7*$F$9)*F24-$F$10,(1-$F$7)*F24-$F$10))","v":9900},null,{"$f":"IF(COUNTBLANK($F$6:$F$10),\"\",F25*$F$7)","v":99},null,null,{"$f":"IF(COUNTBLANK($F$6:$F$10),\"\", IF(L25=\"win\", H25*$F$9-$F$10, IF(L25=\"loss\", -H25-$F$10)))","v":118.8},{"$f":"IF(D25=\"\",\"\",IF(D25<$F$8,\"WIN\",\"LOSS\"))","v":"WIN"},{"$f":"IF(COUNTA($F$6:$F$10)=5,(F26-F24)/F24,\"\")","v":1.8799999999999273E-3},{"$f":"IF(L25=L24,N24+1,1)","v":1},{"$f":"IF(N25=1,IF(N26=1,\"last\",\"new\"),IF(N26=1,\"last\",\"middle\"))","v":"last"},24,{"$f":"COUNTIFS(Outcome,$Q$23,position,\"last\",count,P25)","v":0},0,2.5,"",3.5,"",{"$f":"IF(AND(L25=\"WIN\",L26<>\"WIN\"),SUMIF(L$24:L25,\"WIN\",K$24:K25)-SUM(W$23:W24),\"\")","v":118.8},{"$f":"IF(AND(L25=\"LOSS\",L26<>\"LOSS\"),SUMIF(L$24:L25,\"LOSS\",K$24:K25)-SUM(X$23:X24),\"\")","v":""}]
[null,"Row 26 (3)",null,92.562114487615503,null,{"$f":"IF(COUNTBLANK($F$6:$F$10),\"\",IF(D25<$F$8,(1+$F$7*$F$9)*F25-$F$10,(1-$F$7)*F25-$F$10))","v":10018.799999999999},null,100.18799999999999,null,null,{"$f":"IF(COUNTBLANK($F$6:$F$10),\"\", IF(L26=\"win\", H26*$F$9-$F$10, IF(L26=\"loss\", -H26-$F$10)))","v":-100.18799999999999},"LOSS",{"$f":"IF(COUNTA($F$6:$F$10)=5,(F27-F24)/F24,\"\")","v":-8.1388000000000831E-3},1,"new",23,0,0,4.5,"",5.5,"",{"$f":"IF(AND(L26=\"WIN\",L27<>\"WIN\"),SUMIF(L$24:L26,\"WIN\",K$24:K26)-SUM(W$23:W25),\"\")","v":""},{"$f":"IF(AND(L26=\"LOSS\",L27<>\"LOSS\"),SUMIF(L$24:L26,\"LOSS\",K$24:K26)-SUM(X$23:X25),\"\")","v":""}]
[null,"Row 27 (4)",null,70.231493614681924,null,9918.6119999999992,null,99.186119999999988,null,null,-99.186119999999988,"LOSS",{"$f":"IF(COUNTA($F$6:$F$10)=5,(F28-F24)/F24,\"\")","v":-1.8057412000000113E-2},2,"last",22,0,0,6.5,"",7.5,"",{"$f":"IF(AND(L27=\"WIN\",L28<>\"WIN\"),SUMIF(L$24:L27,\"WIN\",K$24:K27)-SUM(W$23:W26),\"\")","v":""},{"$f":"IF(AND(L27=\"LOSS\",L28<>\"LOSS\"),SUMIF(L$24:L27,\"LOSS\",K$24:K27)-SUM(X$23:X26),\"\")","v":-199.37411999999995}]
[null,"Row 28 (5)",null,34.319853229199701,null,9819.4258799999989,null,98.194258799999986,null,null,117.83311055999998,"WIN",{"$f":"IF(COUNTA($F$6:$F$10)=5,(F29-F24)/F24,\"\")","v":-6.27410094400002E-3},1,"new",21,0,0,8.5,"",9.5,"",{"$f":"IF(AND(L28=\"WIN\",L29<>\"WIN\"),SUMIF(L$24:L28,\"WIN\",K$24:K28)-SUM(W$23:W27),\"\")","v":""},{"$f":"IF(AND(L28=\"LOSS\",L29<>\"LOSS\"),SUMIF(L$24:L28,\"LOSS\",K$24:K28)-SUM(X$23:X27),\"\")","v":""}]
[null,"Row 29 (6)",null,38.031565426341317,null,9937.2589905599998,null,99.372589905599995,null,null,119.24710788671999,"WIN",{"$f":"IF(COUNTA($F$6:$F$10)=5,(F30-F24)/F24,\"\")","v":5.650609844671999E-3},2,"middle",20,0,0,10.5,"",11.5,"",{"$f":"IF(AND(L29=\"WIN\",L30<>\"WIN\"),SUMIF(L$24:L29,\"WIN\",K$24:K29)-SUM(W$23:W28),\"\")","v":""},{"$f":"IF(AND(L29=\"LOSS\",L30<>\"LOSS\"),SUMIF(L$24:L29,\"LOSS\",K$24:K29)-SUM(X$23:X28),\"\")","v":""}]
[null,"Row 30 (7)",null,9.1038901145635514,null,10056.50609844672,null,100.56506098446721,null,null,120.67807318136065,"WIN",{"$f":"IF(COUNTA($F$6:$F$10)=5,(F31-F24)/F24,\"\")","v":1.7718417162808146E-2},3,"middle",19,0,0,12.5,"",13.5,"",{"$f":"IF(AND(L30=\"WIN\",L31<>\"WIN\"),SUMIF(L$24:L30,\"WIN\",K$24:K30)-SUM(W$23:W29),\"\")","v":""},{"$f":"IF(AND(L30=\"LOSS\",L31<>\"LOSS\"),SUMIF(L$24:L30,\"LOSS\",K$24:K30)-SUM(X$23:X29),\"\")","v":""}]
[null,"Row 31 (8)",null,17.378403509669415,null,10177.184171628081,null,101.77184171628082,null,null,122.12621005953697,"WIN",{"$f":"IF(COUNTA($F$6:$F$10)=5,(F32-F24)/F24,\"\")","v":2.9931038168761914E-2},4,"middle",18,0,0,14.5,{"$f":"IF(Q31=0,\"\",Q31*$P31/500)","v":""},{"$f":"S31+1","v":15.5},"",{"$f":"IF(AND(L31=\"WIN\",L32<>\"WIN\"),SUMIF(L$24:L31,\"WIN\",K$24:K31)-SUM(W$23:W30),\"\")","v":""},{"$f":"IF(AND(L31=\"LOSS\",L32<>\"LOSS\"),SUMIF(L$24:L31,\"LOSS\",K$24:K31)-SUM(X$23:X30),\"\")","v":""}]
[null,"Row 32 (9)",null,9.3029402809652773,null,10299.310381687619,null,102.9931038168762,null,null,123.59172458025144,"WIN",{"$f":"IF(COUNTA($F$6:$F$10)=5,(F33-F24)/F24,\"\")","v":4.2290210626787117E-2},5,"last",17,0,0,16.5,"",{"$f":"S32+1","v":17.5},"",{"$f":"IF(AND(L32=\"WIN\",L33<>\"WIN\"),SUMIF(L$24:L32,\"WIN\",K$24:K32)-SUM(W$23:W31),\"\")","v":603.47622626786915},{"$f":"IF(AND(L32=\"LOSS\",L33<>\"LOSS\"),SUMIF(L$24:L32,\"LOSS\",K$24:K32)-SUM(X$23:X31),\"\")","v":""}]
[null,"Row 33 (10)",null,80.030874895333966,null,10422.902106267871,null,104.22902106267871,null,null,-104.22902106267871,"LOSS",{"$f":"IF(COUNTA($F$6:$F$10)=5,(F34-F24)/F24,\"\")","v":3.1867308520519326E-2},1,"last",16,0,0,18.5,"",19.5,"",{"$f":"IF(AND(L33=\"WIN\",L34<>\"WIN\"),SUMIF(L$24:L33,\"WIN\",K$24:K33)-SUM(W$23:W32),\"\")","v":""},{"$f":"IF(AND(L33=\"LOSS\",L34<>\"LOSS\"),SUMIF(L$24:L33,\"LOSS\",K$24:K33)-SUM(X$23:X32),\"\")","v":-104.22902106267873}]
[null,"Row 34 (11)",null,50.25995520030763,null,10318.673085205193,null,103.18673085205194,null,null,123.82407702246232,"WIN",{"$f":"IF(COUNTA($F$6:$F$10)=5,(F35-F24)/F24,\"\")","v":4.424971622276553E-2},1,"last",15,0,0,20.5,"",21.5,"",{"$f":"IF(AND(L34=\"WIN\",L35<>\"WIN\"),SUMIF(L$24:L34,\"WIN\",K$24:K34)-SUM(W$23:W33),\"\")","v":123.82407702246235},{"$f":"IF(AND(L34=\"LOSS\",L35<>\"LOSS\"),SUMIF(L$24:L34,\"LOSS\",K$24:K34)-SUM(X$23:X33),\"\")","v":""}]
[null,"Row 35 (12)",null,55.622000243421354,null,10442.497162227655,null,104.42497162227656,null,null,-104.42497162227656,"LOSS",{"$f":"IF(COUNTA($F$6:$F$10)=5,(F36-F24)/F24,\"\")","v":3.3807219060537866E-2},1,"last",14,0,0,22.5,"",23.5,"",{"$f":"IF(AND(L35=\"WIN\",L36<>\"WIN\"),SUMIF(L$24:L35,\"WIN\",K$24:K35)-SUM(W$23:W34),\"\")","v":""},{"$f":"IF(AND(L35=\"LOSS\",L36<>\"LOSS\"),SUMIF(L$24:L35,\"LOSS\",K$24:K35)-SUM(X$23:X34),\"\")","v":-104.42497162227653}]
[null,"Row 36 (13)",null,16.431315587747729,null,10338.072190605379,null,103.38072190605379,null,null,124.05686628726454,"WIN",{"$f":"IF(COUNTA($F$6:$F$10)=5,(F37-F24)/F24,\"\")","v":4.6212905689264332E-2},1,"last",13,0,0,24.5,"",25.5,"",{"$f":"IF(AND(L36=\"WIN\",L37<>\"WIN\"),SUMIF(L$24:L36,\"WIN\",K$24:K36)-SUM(W$23:W35),\"\")","v":124.0568662872646},{"$f":"IF(AND(L36=\"LOSS\",L37<>\"LOSS\"),SUMIF(L$24:L36,\"LOSS\",K$24:K36)-SUM(X$23:X35),\"\")","v":""}]
[null,"Row 37 (14)",null,72.547567606382884,null,10462.129056892643,null,104.62129056892644,null,null,-104.62129056892644,"LOSS",{"$f":"IF(COUNTA($F$6:$F$10)=5,(F38-F24)/F24,\"\")","v":3.5750776632371709E-2},1,"last",12,0,0,26.5,"",27.5,"",{"$f":"IF(AND(L37=\"WIN\",L38<>\"WIN\"),SUMIF(L$24:L37,\"WIN\",K$24:K37)-SUM(W$23:W36),\"\")","v":""},{"$f":"IF(AND(L37=\"LOSS\",L38<>\"LOSS\"),SUMIF(L$24:L37,\"LOSS\",K$24:K37)-SUM(X$23:X36),\"\")","v":-104.6212905689265}]
[null,"Row 38 (15)",null,12.564244391352364,null,10357.507766323717,null,103.57507766323717,null,null,124.29009319588459,"WIN",{"$f":"IF(COUNTA($F$6:$F$10)=5,(F39-F24)/F24,\"\")","v":4.8179785951960187E-2},1,"last",11,0,0,28.5,"",29.5,"",{"$f":"IF(AND(L38=\"WIN\",L39<>\"WIN\"),SUMIF(L$24:L38,\"WIN\",K$24:K38)-SUM(W$23:W37),\"\")","v":124.29009319588454},{"$f":"IF(AND(L38=\"LOSS\",L39<>\"LOSS\"),SUMIF(L$24:L38,\"LOSS\",K$24:K38)-SUM(X$23:X37),\"\")","v":""}]
[null,"Row 39 (16)",null,64.458536323270664,null,10481.797859519602,null,104.81797859519602,null,null,-104.81797859519602,"LOSS",{"$f":"IF(COUNTA($F$6:$F$10)=5,(F40-F24)/F24,\"\")","v":3.7697988092440571E-2},1,"new",10,1,1,30.5,0.02,31.5,0.02,{"$f":"IF(AND(L39=\"WIN\",L40<>\"WIN\"),SUMIF(L$24:L39,\"WIN\",K$24:K39)-SUM(W$23:W38),\"\")","v":""},{"$f":"IF(AND(L39=\"LOSS\",L40<>\"LOSS\"),SUMIF(L$24:L39,\"LOSS\",K$24:K39)-SUM(X$23:X38),\"\")","v":""}]
[null,"Row 40 (17)",null,58.1795386331139,null,10376.979880924406,null,103.76979880924407,null,null,-103.76979880924407,"LOSS",{"$f":"IF(COUNTA($F$6:$F$10)=5,(F41-F24)/F24,\"\")","v":2.7321008211516163E-2},2,"last",9,0,0,32.5,"",33.5,"",{"$f":"IF(AND(L40=\"WIN\",L41<>\"WIN\"),SUMIF(L$24:L40,\"WIN\",K$24:K40)-SUM(W$23:W39),\"\")","v":""},{"$f":"IF(AND(L40=\"LOSS\",L41<>\"LOSS\"),SUMIF(L$24:L40,\"LOSS\",K$24:K40)-SUM(X$23:X39),\"\")","v":-208.58777740444009}]
[null,"Row 41 (18)",null,48.973056430192294,null,10273.210082115162,null,102.73210082115162,null,null,123.27852098538193,"WIN",{"$f":"IF(COUNTA($F$6:$F$10)=5,(F42-F24)/F24,\"\")","v":3.9648860310054442E-2},1,"last",8,0,0,34.5,"",{"$f":"S41+1","v":35.5},"",{"$f":"IF(AND(L41=\"WIN\",L42<>\"WIN\"),SUMIF(L$24:L41,\"WIN\",K$24:K41)-SUM(W$23:W40),\"\")","v":123.27852098538187},{"$f":"IF(AND(L41=\"LOSS\",L42<>\"LOSS\"),SUMIF(L$24:L41,\"LOSS\",K$24:K41)-SUM(X$23:X40),\"\")","v":""}]
[null,"Row 42 (19)",null,64.073025886422727,null,10396.488603100544,null,103.96488603100545,null,null,-103.96488603100545,"LOSS",{"$f":"IF(COUNTA($F$6:$F$10)=5,(F43-F24)/F24,\"\")","v":2.9252371706953818E-2},1,"last",7,2,0,36.5,2.8000000000000001E-2,{"$f":"S42+1","v":37.5},"",{"$f":"IF(AND(L42=\"WIN\",L43<>\"WIN\"),SUMIF(L$24:L42,\"WIN\",K$24:K42)-SUM(W$23:W41),\"\")","v":""},{"$f":"IF(AND(L42=\"LOSS\",L43<>\"LOSS\"),SUMIF(L$24:L42,\"LOSS\",K$24:K42)-SUM(X$23:X41),\"\")","v":-103.96488603100545}]
[null,"Row 43 (20)",null,23.971103612374712,null,10292.523717069538,null,102.92523717069538,null,null,123.51028460483445,"WIN",{"$f":"IF(COUNTA($F$6:$F$10)=5,(F44-F24)/F24,\"\")","v":4.1603400167437209E-2},1,"last",6,4,0,38.5,4.8000000000000001E-2,39.5,"",{"$f":"IF(AND(L43=\"WIN\",L44<>\"WIN\"),SUMIF(L$24:L43,\"WIN\",K$24:K43)-SUM(W$23:W42),\"\")","v":123.5102846048344},{"$f":"IF(AND(L43=\"LOSS\",L44<>\"LOSS\"),SUMIF(L$24:L43,\"LOSS\",K$24:K43)-SUM(X$23:X42),\"\")","v":""}]
[null,"Row 44 (21)",null,62.103400124685059,null,10416.034001674372,null,104.16034001674372,null,null,-104.16034001674372,"LOSS",{"$f":"IF(COUNTA($F$6:$F$10)=5,(F45-F24)/F24,\"\")","v":3.1187366165762797E-2},1,"last",5,7,3,40.5,7.0000000000000007E-2,{"$f":"S44+1","v":41.5},0.03,{"$f":"IF(AND(L44=\"WIN\",L45<>\"WIN\"),SUMIF(L$24:L44,\"WIN\",K$24:K44)-SUM(W$23:W43),\"\")","v":""},{"$f":"IF(AND(L44=\"LOSS\",L45<>\"LOSS\"),SUMIF(L$24:L44,\"LOSS\",K$24:K44)-SUM(X$23:X43),\"\")","v":-104.1603400167437}]
[null,"Row 45 (22)",null,11.542113703554957,null,10311.873661657628,null,103.11873661657629,null,null,123.74248393989154,"WIN",{"$f":"IF(COUNTA($F$6:$F$10)=5,(F46-F24)/F24,\"\")","v":4.3561614559751979E-2},1,"new",4,6,8,42.5,4.8000000000000001E-2,{"$f":"S45+1","v":43.5},6.4000000000000001E-2,{"$f":"IF(AND(L45=\"WIN\",L46<>\"WIN\"),SUMIF(L$24:L45,\"WIN\",K$24:K45)-SUM(W$23:W44),\"\")","v":""},{"$f":"IF(AND(L45=\"LOSS\",L46<>\"LOSS\"),SUMIF(L$24:L45,\"LOSS\",K$24:K45)-SUM(X$23:X44),\"\")","v":""}]
[null,"Row 46 (23)",null,39.814740273396488,null,10435.61614559752,null,104.3561614559752,null,null,125.22739374717023,"WIN",{"$f":"IF(COUNTA($F$6:$F$10)=5,(F47-F24)/F24,\"\")","v":5.6084353934469075E-2},2,"middle",3,19,10,44.5,0.114,45.5,0.06,{"$f":"IF(AND(L46=\"WIN\",L47<>\"WIN\"),SUMIF(L$24:L46,\"WIN\",K$24:K46)-SUM(W$23:W45),\"\")","v":""},{"$f":"IF(AND(L46=\"LOSS\",L47<>\"LOSS\"),SUMIF(L$24:L46,\"LOSS\",K$24:K46)-SUM(X$23:X45),\"\")","v":""}]
[null,"Row 47 (24)",null,25.978230718241125,null,10560.843539344691,null,105.60843539344691,null,null,126.73012247213629,"WIN",{"$f":"IF(COUNTA($F$6:$F$10)=5,(F48-F24)/F24,\"\")","v":6.8757366181682669E-2},3,"last",2,26,42,46.5,0.104,47.5,0.16800000000000001,{"$f":"IF(AND(L47=\"WIN\",L48<>\"WIN\"),SUMIF(L$24:L47,\"WIN\",K$24:K47)-SUM(W$23:W46),\"\")","v":375.70000015919823},{"$f":"IF(AND(L47=\"LOSS\",L48<>\"LOSS\"),SUMIF(L$24:L47,\"LOSS\",K$24:K47)-SUM(X$23:X46),\"\")","v":""}]
[null,"Row 48 (25)",null,68.181299376411246,null,10687.573661816827,null,106.87573661816828,null,null,-106.87573661816828,"LOSS",{"$f":"IF(COUNTA($F$6:$F$10)=5,(F49-F24)/F24,\"\")","v":5.8069792519865771E-2},1,"new",1,55,57,48.5,{"$f":"IF(Q48=0,\"\",Q48*$P48/500)","v":0.11},49.5,{"$f":"IF(R48=0,\"\",R48*$P48/500)","v":0.114},{"$f":"IF(AND(L48=\"WIN\",L49<>\"WIN\"),SUMIF(L$24:L48,\"WIN\",K$24:K48)-SUM(W$23:W47),\"\")","v":""},{"$f":"IF(AND(L48=\"LOSS\",L49<>\"LOSS\"),SUMIF(L$24:L48,\"LOSS\",K$24:K48)-SUM(X$23:X47),\"\")","v":""}]
[null,"Row 49 (26)",null,99.773892307945502,null,10580.697925198658,null,105.80697925198658,null,null,-105.80697925198658,"LOSS",{"$f":"IF(COUNTA($F$6:$F$10)=5,(F50-F24)/F24,\"\")","v":4.748909459466704E-2},2,"last",null,null,null,null,null,null,null,{"$f":"IF(AND(L49=\"WIN\",L50<>\"WIN\"),SUMIF(L$24:L49,\"WIN\",K$24:K49)-SUM(W$23:W48),\"\")","v":""},{"$f":"IF(AND(L49=\"LOSS\",L50<>\"LOSS\"),SUMIF(L$24:L49,\"LOSS\",K$24:K49)-SUM(X$23:X48),\"\")","v":-212.68271587015488}]
[null,"Row 50 (27)",null,8.9520086033897055,null,10474.89094594667,null,104.7489094594667,null,null,125.69869135136004,"WIN",{"$f":"IF(COUNTA($F$6:$F$10)=5,(F51-F24)/F24,\"\")","v":6.0058963729803141E-2},1,"last",null,null,null,null,null,null,null,{"$f":"IF(AND(L50=\"WIN\",L51<>\"WIN\"),SUMIF(L$24:L50,\"WIN\",K$24:K50)-SUM(W$23:W49),\"\")","v":125.69869135136014},{"$f":"IF(AND(L50=\"LOSS\",L51<>\"LOSS\"),SUMIF(L$24:L50,\"LOSS\",K$24:K50)-SUM(X$23:X49),\"\")","v":""}]
[null,"Row 51 (28)",null,65.052209768408403,null,10600.589637298031,null,106.00589637298032,null,null,-106.00589637298032,"LOSS",{"$f":"IF(COUNTA($F$6:$F$10)=5,(F52-F24)/F24,\"\")","v":4.9458374092505072E-2},1,"last",null,null,null,null,null,null,null,{"$f":"IF(AND(L51=\"WIN\",L52<>\"WIN\"),SUMIF(L$24:L51,\"WIN\",K$24:K51)-SUM(W$23:W50),\"\")","v":""},{"$f":"IF(AND(L51=\"LOSS\",L52<>\"LOSS\"),SUMIF(L$24:L51,\"LOSS\",K$24:K51)-SUM(X$23:X50),\"\")","v":-106.00589637298026}]
[null,"Row 52 (29)",null,23.517152661519258,null,10494.583740925051,null,104.94583740925052,null,null,125.93500489110062,"WIN",{"$f":"IF(COUNTA($F$6:$F$10)=5,(F53-F24)/F24,\"\")","v":6.2051874581615082E-2},1,"new",null,null,null,null,null,null,null,{"$f":"IF(AND(L52=\"WIN\",L53<>\"WIN\"),SUMIF(L$24:L52,\"WIN\",K$24:K52)-SUM(W$23:W51),\"\")","v":""},{"$f":"IF(AND(L52=\"LOSS\",L53<>\"LOSS\"),SUMIF(L$24:L52,\"LOSS\",K$24:K52)-SUM(X$23:X51),\"\")","v":""}]
[null,"Row 53 (30)",null,23.630755628769418,null,10620.518745816151,null,106.2051874581615,null,null,127.4462249497938,"WIN",{"$f":"IF(COUNTA($F$6:$F$10)=5,(F54-F24)/F24,\"\")","v":7.4796497076594456E-2},2,"middle",null,null,null,null,null,null,null,{"$f":"IF(AND(L53=\"WIN\",L54<>\"WIN\"),SUMIF(L$24:L53,\"WIN\",K$24:K53)-SUM(W$23:W52),\"\")","v":""},{"$f":"IF(AND(L53=\"LOSS\",L54<>\"LOSS\"),SUMIF(L$24:L53,\"LOSS\",K$24:K53)-SUM(X$23:X52),\"\")","v":""}]
[null,"Row 54 (31)",null,34.211538644718544,null,10747.964970765945,null,107.47964970765945,null,null,128.97557964919133,"WIN",{"$f":"IF(COUNTA($F$6:$F$10)=5,(F55-F24)/F24,\"\")","v":8.7694055041513633E-2},3,"middle",null,null,null,null,null,null,null,{"$f":"IF(AND(L54=\"WIN\",L55<>\"WIN\"),SUMIF(L$24:L54,\"WIN\",K$24:K54)-SUM(W$23:W53),\"\")","v":""},{"$f":"IF(AND(L54=\"LOSS\",L55<>\"LOSS\"),SUMIF(L$24:L54,\"LOSS\",K$24:K54)-SUM(X$23:X53),\"\")","v":""}]
[null,"Row 55 (32)",null,45.767209845050814,null,10876.940550415136,null,108.76940550415136,null,null,130.52328660498162,"WIN",{"$f":"IF(COUNTA($F$6:$F$10)=5,(F56-F24)/F24,\"\")","v":0.10074638370201174},4,"middle",null,null,null,null,null,null,null,{"$f":"IF(AND(L55=\"WIN\",L56<>\"WIN\"),SUMIF(L$24:L55,\"WIN\",K$24:K55)-SUM(W$23:W54),\"\")","v":""},{"$f":"IF(AND(L55=\"LOSS\",L56<>\"LOSS\"),SUMIF(L$24:L55,\"LOSS\",K$24:K55)-SUM(X$23:X54),\"\")","v":""}]
[null,"Row 56 (33)",null,5.9460621273329739,null,11007.463837020117,null,110.07463837020117,null,null,132.08956604424139,"WIN",{"$f":"IF(COUNTA($F$6:$F$10)=5,(F57-F24)/F24,\"\")","v":0.11395534030643593},5,"middle",null,null,null,null,null,null,null,{"$f":"IF(AND(L56=\"WIN\",L57<>\"WIN\"),SUMIF(L$24:L56,\"WIN\",K$24:K56)-SUM(W$23:W55),\"\")","v":""},{"$f":"IF(AND(L56=\"LOSS\",L57<>\"LOSS\"),SUMIF(L$24:L56,\"LOSS\",K$24:K56)-SUM(X$23:X55),\"\")","v":""}]
[null,"Row 57 (34)",null,30.782881062566471,null,11139.553403064359,null,111.3955340306436,null,null,133.67464083677231,"WIN",{"$f":"IF(COUNTA($F$6:$F$10)=5,(F58-F24)/F24,\"\")","v":0.1273228043901132},6,"last",null,null,null,null,null,null,null,{"$f":"IF(AND(L57=\"WIN\",L58<>\"WIN\"),SUMIF(L$24:L57,\"WIN\",K$24:K57)-SUM(W$23:W56),\"\")","v":778.64430297608101},{"$f":"IF(AND(L57=\"LOSS\",L58<>\"LOSS\"),SUMIF(L$24:L57,\"LOSS\",K$24:K57)-SUM(X$23:X56),\"\")","v":""}]
[null,"Row 58 (35)",null,85.780642011696585,null,11273.228043901132,null,112.73228043901132,null,null,-112.73228043901132,"LOSS",{"$f":"IF(COUNTA($F$6:$F$10)=5,(F59-F24)/F24,\"\")","v":0.11604957634621205},1,"last",null,null,null,null,null,null,null,{"$f":"IF(AND(L58=\"WIN\",L59<>\"WIN\"),SUMIF(L$24:L58,\"WIN\",K$24:K58)-SUM(W$23:W57),\"\")","v":""},{"$f":"IF(AND(L58=\"LOSS\",L59<>\"LOSS\"),SUMIF(L$24:L58,\"LOSS\",K$24:K58)-SUM(X$23:X57),\"\")","v":-112.73228043901122}]
[null,"Row 59 (36)",null,2.2467448436175763,null,11160.495763462121,null,111.6049576346212,null,null,133.92594916154545,"WIN",{"$f":"IF(COUNTA($F$6:$F$10)=5,(F60-F24)/F24,\"\")","v":0.12944217126236654},1,"new",null,null,null,null,null,null,null,{"$f":"IF(AND(L59=\"WIN\",L60<>\"WIN\"),SUMIF(L$24:L59,\"WIN\",K$24:K59)-SUM(W$23:W58),\"\")","v":""},{"$f":"IF(AND(L59=\"LOSS\",L60<>\"LOSS\"),SUMIF(L$24:L59,\"LOSS\",K$24:K59)-SUM(X$23:X58),\"\")","v":""}]
[null,"Row 60 (37)",null,36.964185895872859,null,11294.421712623665,null,112.94421712623665,null,null,135.53306055148397,"WIN",{"$f":"IF(COUNTA($F$6:$F$10)=5,(F61-F24)/F24,\"\")","v":0.142995477317515},2,"middle",null,null,null,null,null,null,null,{"$f":"IF(AND(L60=\"WIN\",L61<>\"WIN\"),SUMIF(L$24:L60,\"WIN\",K$24:K60)-SUM(W$23:W59),\"\")","v":""},{"$f":"IF(AND(L60=\"LOSS\",L61<>\"LOSS\"),SUMIF(L$24:L60,\"LOSS\",K$24:K60)-SUM(X$23:X59),\"\")","v":""}]
[null,"Row 61 (38)",null,0.10420651895546307,null,11429.95477317515,null,114.2995477317515,null,null,137.1594572781018,"WIN",{"$f":"IF(COUNTA($F$6:$F$10)=5,(F62-F24)/F24,\"\")","v":0.15671142304532515},3,"middle",null,null,null,null,null,null,null,{"$f":"IF(AND(L61=\"WIN\",L62<>\"WIN\"),SUMIF(L$24:L61,\"WIN\",K$24:K61)-SUM(W$23:W60),\"\")","v":""},{"$f":"IF(AND(L61=\"LOSS\",L62<>\"LOSS\"),SUMIF(L$24:L61,\"LOSS\",K$24:K61)-SUM(X$23:X60),\"\")","v":""}]
[null,"Row 62 (39)",null,43.660664988363528,null,11567.114230453251,null,115.67114230453251,null,null,138.80537076543899,"WIN",{"$f":"IF(COUNTA($F$6:$F$10)=5,(F63-F24)/F24,\"\")","v":0.17059196012186911},4,"last",null,null,null,null,null,null,null,{"$f":"IF(AND(L62=\"WIN\",L63<>\"WIN\"),SUMIF(L$24:L62,\"WIN\",K$24:K62)-SUM(W$23:W61),\"\")","v":545.42383775657026},{"$f":"IF(AND(L62=\"LOSS\",L63<>\"LOSS\"),SUMIF(L$24:L62,\"LOSS\",K$24:K62)-SUM(X$23:X61),\"\")","v":""}]
[null,"Row 63 (40)",null,68.319494813529687,null,11705.919601218691,null,117.05919601218692,null,null,-117.05919601218692,"LOSS",{"$f":"IF(COUNTA($F$6:$F$10)=5,(F64-F24)/F24,\"\")","v":0.15888604052065039},1,"last",null,null,null,null,null,null,null,{"$f":"IF(AND(L63=\"WIN\",L64<>\"WIN\"),SUMIF(L$24:L63,\"WIN\",K$24:K63)-SUM(W$23:W62),\"\")","v":""},{"$f":"IF(AND(L63=\"LOSS\",L64<>\"LOSS\"),SUMIF(L$24:L63,\"LOSS\",K$24:K63)-SUM(X$23:X62),\"\")","v":-117.05919601218693}]
[null,"Row 64 (41)",null,23.52744204260464,null,11588.860405206504,null,115.88860405206503,null,null,139.06632486247804,"WIN",{"$f":"IF(COUNTA($F$6:$F$10)=5,(F65-F24)/F24,\"\")","v":0.17279267300689827},1,"new",null,null,null,null,null,null,null,{"$f":"IF(AND(L64=\"WIN\",L65<>\"WIN\"),SUMIF(L$24:L64,\"WIN\",K$24:K64)-SUM(W$23:W63),\"\")","v":""},{"$f":"IF(AND(L64=\"LOSS\",L65<>\"LOSS\"),SUMIF(L$24:L64,\"LOSS\",K$24:K64)-SUM(X$23:X63),\"\")","v":""}]
[null,"Row 65 (42)",null,4.7335442281811417,null,11727.926730068983,null,117.27926730068982,null,null,140.73512076082778,"WIN",{"$f":"IF(COUNTA($F$6:$F$10)=5,(F66-F24)/F24,\"\")","v":0.18686618508298106},2,"middle",null,null,null,null,null,null,null,{"$f":"IF(AND(L65=\"WIN\",L66<>\"WIN\"),SUMIF(L$24:L65,\"WIN\",K$24:K65)-SUM(W$23:W64),\"\")","v":""},{"$f":"IF(AND(L65=\"LOSS\",L66<>\"LOSS\"),SUMIF(L$24:L65,\"LOSS\",K$24:K65)-SUM(X$23:X64),\"\")","v":""}]
[null,"Row 66 (43)",null,41.87735903721488,null,11868.661850829811,null,118.68661850829811,null,null,142.42394220995772,"WIN",{"$f":"IF(COUNTA($F$6:$F$10)=5,(F67-F24)/F24,\"\")","v":0.20110857930397688},3,"middle",null,null,null,null,null,null,null,{"$f":"IF(AND(L66=\"WIN\",L67<>\"WIN\"),SUMIF(L$24:L66,\"WIN\",K$24:K66)-SUM(W$23:W65),\"\")","v":""},{"$f":"IF(AND(L66=\"LOSS\",L67<>\"LOSS\"),SUMIF(L$24:L66,\"LOSS\",K$24:K66)-SUM(X$23:X65),\"\")","v":""}]
[null,"Row 67 (44)",null,11.053856416019837,null,12011.085793039769,null,120.11085793039769,null,null,144.13302951647722,"WIN",{"$f":"IF(COUNTA($F$6:$F$10)=5,(F68-F24)/F24,\"\")","v":0.21552188225562458},4,"middle",null,null,null,null,null,null,null,{"$f":"IF(AND(L67=\"WIN\",L68<>\"WIN\"),SUMIF(L$24:L67,\"WIN\",K$24:K67)-SUM(W$23:W66),\"\")","v":""},{"$f":"IF(AND(L67=\"LOSS\",L68<>\"LOSS\"),SUMIF(L$24:L67,\"LOSS\",K$24:K67)-SUM(X$23:X66),\"\")","v":""}]
[null,"Row 68 (45)",null,8.4194996447645494,null,12155.218822556246,null,121.55218822556246,null,null,145.86262587067495,"WIN",{"$f":"IF(COUNTA($F$6:$F$10)=5,(F69-F24)/F24,\"\")","v":0.23010814484269212},5,"middle",null,null,null,null,null,null,null,{"$f":"IF(AND(L68=\"WIN\",L69<>\"WIN\"),SUMIF(L$24:L68,\"WIN\",K$24:K68)-SUM(W$23:W67),\"\")","v":""},{"$f":"IF(AND(L68=\"LOSS\",L69<>\"LOSS\"),SUMIF(L$24:L68,\"LOSS\",K$24:K68)-SUM(X$23:X67),\"\")","v":""}]
[null,"Row 69 (46)",null,52.910866729244802,null,12301.081448426921,null,123.01081448426922,null,null,147.61297738112305,"WIN",{"$f":"IF(COUNTA($F$6:$F$10)=5,(F70-F24)/F24,\"\")","v":0.2448694425808044},6,"last",null,null,null,null,null,null,null,{"$f":"IF(AND(L69=\"WIN\",L70<>\"WIN\"),SUMIF(L$24:L69,\"WIN\",K$24:K69)-SUM(W$23:W68),\"\")","v":859.83402060153867},{"$f":"IF(AND(L69=\"LOSS\",L70<>\"LOSS\"),SUMIF(L$24:L69,\"LOSS\",K$24:K69)-SUM(X$23:X68),\"\")","v":""}]
[null,"Row 70 (47)",null,98.412764119926024,null,12448.694425808044,null,124.48694425808044,null,null,-124.48694425808044,"LOSS",{"$f":"IF(COUNTA($F$6:$F$10)=5,(F71-F24)/F24,\"\")","v":0.23242074815499636},1,"new",null,null,null,null,null,null,null,{"$f":"IF(AND(L70=\"WIN\",L71<>\"WIN\"),SUMIF(L$24:L70,\"WIN\",K$24:K70)-SUM(W$23:W69),\"\")","v":""},{"$f":"IF(AND(L70=\"LOSS\",L71<>\"LOSS\"),SUMIF(L$24:L70,\"LOSS\",K$24:K70)-SUM(X$23:X69),\"\")","v":""}]
[null,"Row 71 (48)",null,56.0100787498614,null,12324.207481549964,null,123.24207481549963,null,null,-123.24207481549963,"LOSS",{"$f":"IF(COUNTA($F$6:$F$10)=5,(F72-F24)/F24,\"\")","v":0.22009654067344636},2,"last",null,null,null,null,null,null,null,{"$f":"IF(AND(L71=\"WIN\",L72<>\"WIN\"),SUMIF(L$24:L71,\"WIN\",K$24:K71)-SUM(W$23:W70),\"\")","v":""},{"$f":"IF(AND(L71=\"LOSS\",L72<>\"LOSS\"),SUMIF(L$24:L71,\"LOSS\",K$24:K71)-SUM(X$23:X70),\"\")","v":-247.72901907358005}]
[null,"Row 72 (49)",null,18.304237430360104,null,12200.965406734464,null,122.00965406734464,null,null,146.41158488081356,"WIN",{"$f":"IF(COUNTA($F$6:$F$10)=5,(F73-F24)/F24,\"\")","v":0.23473769916152779},1,"last",null,null,null,null,null,null,null,{"$f":"IF(AND(L72=\"WIN\",L73<>\"WIN\"),SUMIF(L$24:L72,\"WIN\",K$24:K72)-SUM(W$23:W71),\"\")","v":146.41158488081328},{"$f":"IF(AND(L72=\"LOSS\",L73<>\"LOSS\"),SUMIF(L$24:L72,\"LOSS\",K$24:K72)-SUM(X$23:X71),\"\")","v":""}]
[null,"Row 73 (50)",null,86.459032117867082,null,12347.376991615278,null,123.47376991615278,null,null,-123.47376991615278,"LOSS",{"$f":"IF(COUNTA($F$6:$F$10)=5,(F74-F24)/F24,\"\")","v":0.22239032216991253},1,"last",null,null,null,null,null,null,null,{"$f":"IF(AND(L73=\"WIN\",L74<>\"WIN\"),SUMIF(L$24:L73,\"WIN\",K$24:K73)-SUM(W$23:W72),\"\")","v":""},{"$f":"IF(AND(L73=\"LOSS\",L74<>\"LOSS\"),SUMIF(L$24:L73,\"LOSS\",K$24:K73)-SUM(X$23:X72),\"\")","v":-123.47376991615283}]
[null,"Row 74 (51)",null,52.87125698314761,null,12223.903221699125,null,122.23903221699126,null,null,146.6868386603895,"WIN",{"$f":"IF(COUNTA($F$6:$F$10)=5,(F75-F24)/F24,\"\")","v":0.23705900603595145},1,"last",null,null,null,null,null,null,null,{"$f":"IF(AND(L74=\"WIN\",L75<>\"WIN\"),SUMIF(L$24:L74,\"WIN\",K$24:K74)-SUM(W$23:W73),\"\")","v":146.68683866038918},{"$f":"IF(AND(L74=\"LOSS\",L75<>\"LOSS\"),SUMIF(L$24:L74,\"LOSS\",K$24:K74)-SUM(X$23:X73),\"\")","v":""}]
[null,"Row 75 (52)",null,72.368160717988545,null,12370.590060359515,null,123.70590060359515,null,null,-123.70590060359515,"LOSS",{"$f":"IF(COUNTA($F$6:$F$10)=5,(F76-F24)/F24,\"\")","v":0.22468841597559186},1,"new",null,null,null,null,null,null,null,{"$f":"IF(AND(L75=\"WIN\",L76<>\"WIN\"),SUMIF(L$24:L75,\"WIN\",K$24:K75)-SUM(W$23:W74),\"\")","v":""},{"$f":"IF(AND(L75=\"LOSS\",L76<>\"LOSS\"),SUMIF(L$24:L75,\"LOSS\",K$24:K75)-SUM(X$23:X74),\"\")","v":""}]
[null,"Row 76 (53)",null,69.466794095325582,null,12246.884159755919,null,122.46884159755919,null,null,-122.46884159755919,"LOSS",{"$f":"IF(COUNTA($F$6:$F$10)=5,(F77-F24)/F24,\"\")","v":0.21244153181583589},2,"last",null,null,null,null,null,null,null,{"$f":"IF(AND(L76=\"WIN\",L77<>\"WIN\"),SUMIF(L$24:L76,\"WIN\",K$24:K76)-SUM(W$23:W75),\"\")","v":""},{"$f":"IF(AND(L76=\"LOSS\",L77<>\"LOSS\"),SUMIF(L$24:L76,\"LOSS\",K$24:K76)-SUM(X$23:X75),\"\")","v":-246.17474220115446}]
[null,"Row 77 (54)",null,49.151236719937884,null,12124.415318158359,null,121.24415318158358,null,null,145.4929838179003,"WIN",{"$f":"IF(COUNTA($F$6:$F$10)=5,(F78-F24)/F24,\"\")","v":0.22699083019762584},1,"new",null,null,null,null,null,null,null,{"$f":"IF(AND(L77=\"WIN\",L78<>\"WIN\"),SUMIF(L$24:L77,\"WIN\",K$24:K77)-SUM(W$23:W76),\"\")","v":""},{"$f":"IF(AND(L77=\"LOSS\",L78<>\"LOSS\"),SUMIF(L$24:L77,\"LOSS\",K$24:K77)-SUM(X$23:X76),\"\")","v":""}]
[null,"Row 78 (55)",null,17.235513367943312,null,12269.908301976258,null,122.69908301976258,null,null,147.2388996237151,"WIN",{"$f":"IF(COUNTA($F$6:$F$10)=5,(F79-F24)/F24,\"\")","v":0.24171472015999734},2,"middle",null,null,null,null,null,null,null,{"$f":"IF(AND(L78=\"WIN\",L79<>\"WIN\"),SUMIF(L$24:L78,\"WIN\",K$24:K78)-SUM(W$23:W77),\"\")","v":""},{"$f":"IF(AND(L78=\"LOSS\",L79<>\"LOSS\"),SUMIF(L$24:L78,\"LOSS\",K$24:K78)-SUM(X$23:X77),\"\")","v":""}]
[null,"Row 79 (56)",null,53.560585907411571,null,12417.147201599973,null,124.17147201599974,null,null,149.00576641919969,"WIN",{"$f":"IF(COUNTA($F$6:$F$10)=5,(F80-F24)/F24,\"\")","v":0.25661529680191725},3,"last",null,null,null,null,null,null,null,{"$f":"IF(AND(L79=\"WIN\",L80<>\"WIN\"),SUMIF(L$24:L79,\"WIN\",K$24:K79)-SUM(W$23:W78),\"\")","v":441.73764986081551},{"$f":"IF(AND(L79=\"LOSS\",L80<>\"LOSS\"),SUMIF(L$24:L79,\"LOSS\",K$24:K79)-SUM(X$23:X78),\"\")","v":""}]
[null,"Row 80 (57)",null,97.614089983318024,null,12566.152968019172,null,125.66152968019173,null,null,-125.66152968019173,"LOSS",{"$f":"IF(COUNTA($F$6:$F$10)=5,(F81-F24)/F24,\"\")","v":0.24404914383389806},1,"last",null,null,null,null,null,null,null,{"$f":"IF(AND(L80=\"WIN\",L81<>\"WIN\"),SUMIF(L$24:L80,\"WIN\",K$24:K80)-SUM(W$23:W79),\"\")","v":""},{"$f":"IF(AND(L80=\"LOSS\",L81<>\"LOSS\"),SUMIF(L$24:L80,\"LOSS\",K$24:K80)-SUM(X$23:X79),\"\")","v":-125.66152968019196}]
[null,"Row 81 (58)",null,14.520655978339182,null,12440.491438338981,null,124.40491438338981,null,null,149.28589726006777,"WIN",{"$f":"IF(COUNTA($F$6:$F$10)=5,(F82-F24)/F24,\"\")","v":0.25897773355990483},1,"new",null,null,null,null,null,null,null,{"$f":"IF(AND(L81=\"WIN\",L82<>\"WIN\"),SUMIF(L$24:L81,\"WIN\",K$24:K81)-SUM(W$23:W80),\"\")","v":""},{"$f":"IF(AND(L81=\"LOSS\",L82<>\"LOSS\"),SUMIF(L$24:L81,\"LOSS\",K$24:K81)-SUM(X$23:X80),\"\")","v":""}]
[null,"Row 82 (59)",null,25.760481688755554,null,12589.777335599048,null,125.89777335599048,null,null,151.07732802718857,"WIN",{"$f":"IF(COUNTA($F$6:$F$10)=5,(F83-F24)/F24,\"\")","v":0.27408546636262365},2,"last",null,null,null,null,null,null,null,{"$f":"IF(AND(L82=\"WIN\",L83<>\"WIN\"),SUMIF(L$24:L82,\"WIN\",K$24:K82)-SUM(W$23:W81),\"\")","v":300.36322528725668},{"$f":"IF(AND(L82=\"LOSS\",L83<>\"LOSS\"),SUMIF(L$24:L82,\"LOSS\",K$24:K82)-SUM(X$23:X81),\"\")","v":""}]
[null,"Row 83 (60)",null,94.19266857265653,null,12740.854663626236,null,127.40854663626237,null,null,-127.40854663626237,"LOSS",{"$f":"IF(COUNTA($F$6:$F$10)=5,(F84-F24)/F24,\"\")","v":0.26134461169899731},1,"new",null,null,null,null,null,null,null,{"$f":"IF(AND(L83=\"WIN\",L84<>\"WIN\"),SUMIF(L$24:L83,\"WIN\",K$24:K83)-SUM(W$23:W82),\"\")","v":""},{"$f":"IF(AND(L83=\"LOSS\",L84<>\"LOSS\"),SUMIF(L$24:L83,\"LOSS\",K$24:K83)-SUM(X$23:X82),\"\")","v":""}]
[null,"Row 84 (61)",null,76.623031793060605,null,12613.446116989973,null,126.13446116989974,null,null,-126.13446116989974,"LOSS",{"$f":"IF(COUNTA($F$6:$F$10)=5,(F85-F24)/F24,\"\")","v":0.24873116558200728},2,"last",null,null,null,null,null,null,null,{"$f":"IF(AND(L84=\"WIN\",L85<>\"WIN\"),SUMIF(L$24:L84,\"WIN\",K$24:K84)-SUM(W$23:W83),\"\")","v":""},{"$f":"IF(AND(L84=\"LOSS\",L85<>\"LOSS\"),SUMIF(L$24:L84,\"LOSS\",K$24:K84)-SUM(X$23:X83),\"\")","v":-253.54300780616177}]
[null,"Row 85 (62)",null,38.628655139322262,null,12487.311655820073,null,124.87311655820073,null,null,149.84773986984086,"WIN",{"$f":"IF(COUNTA($F$6:$F$10)=5,(F86-F24)/F24,\"\")","v":0.26371593956899142},1,"last",null,null,null,null,null,null,null,{"$f":"IF(AND(L85=\"WIN\",L86<>\"WIN\"),SUMIF(L$24:L85,\"WIN\",K$24:K85)-SUM(W$23:W84),\"\")","v":149.84773986984055},{"$f":"IF(AND(L85=\"LOSS\",L86<>\"LOSS\"),SUMIF(L$24:L85,\"LOSS\",K$24:K85)-SUM(X$23:X84),\"\")","v":""}]
[null,"Row 86 (63)",null,71.784414920200732,null,12637.159395689914,null,126.37159395689915,null,null,-126.37159395689915,"LOSS",{"$f":"IF(COUNTA($F$6:$F$10)=5,(F87-F24)/F24,\"\")","v":0.25107878017330149},1,"new",null,null,null,null,null,null,null,{"$f":"IF(AND(L86=\"WIN\",L87<>\"WIN\"),SUMIF(L$24:L86,\"WIN\",K$24:K86)-SUM(W$23:W85),\"\")","v":""},{"$f":"IF(AND(L86=\"LOSS\",L87<>\"LOSS\"),SUMIF(L$24:L86,\"LOSS\",K$24:K86)-SUM(X$23:X85),\"\")","v":""}]
[null,"Row 87 (64)",null,74.47815687965678,null,12510.787801733015,null,125.10787801733015,null,null,-125.10787801733015,"LOSS",{"$f":"IF(COUNTA($F$6:$F$10)=5,(F88-F24)/F24,\"\")","v":0.23856799237156848},2,"middle",null,null,null,null,null,null,null,{"$f":"IF(AND(L87=\"WIN\",L88<>\"WIN\"),SUMIF(L$24:L87,\"WIN\",K$24:K87)-SUM(W$23:W86),\"\")","v":""},{"$f":"IF(AND(L87=\"LOSS\",L88<>\"LOSS\"),SUMIF(L$24:L87,\"LOSS\",K$24:K87)-SUM(X$23:X86),\"\")","v":""}]
[null,"Row 88 (65)",null,97.96062222795814,null,12385.679923715685,null,123.85679923715685,null,null,-123.85679923715685,"LOSS",{"$f":"IF(COUNTA($F$6:$F$10)=5,(F89-F24)/F24,\"\")","v":0.22618231244785275},3,"last",null,null,null,null,null,null,null,{"$f":"IF(AND(L88=\"WIN\",L89<>\"WIN\"),SUMIF(L$24:L88,\"WIN\",K$24:K88)-SUM(W$23:W87),\"\")","v":""},{"$f":"IF(AND(L88=\"LOSS\",L89<>\"LOSS\"),SUMIF(L$24:L88,\"LOSS\",K$24:K88)-SUM(X$23:X87),\"\")","v":-375.33627121138625}]
[null,"Row 89 (66)",null,{"$f":"IF(COUNTA($F$6:$F$10)=5,100*RAND(),\"\")","v":10.105614875905722},null,12261.823124478527,null,{"$f":"IF(COUNTBLANK($F$6:$F$10),\"\",F89*$F$7)","v":122.61823124478528},null,null,147.14187749374233,{"$f":"IF(D89=\"\",\"\",IF(D89<$F$8,\"WIN\",\"LOSS\"))","v":"WIN"},{"$f":"IF(COUNTA($F$6:$F$10)=5,(F90-F24)/F24,\"\")","v":0.24089650019722703},{"$f":"IF(L89=L88,N88+1,1)","v":1},{"$f":"IF(N89=1,IF(N90=1,\"last\",\"new\"),IF(N90=1,\"last\",\"middle\"))","v":"last"},null,null,null,null,null,null,null,{"$f":"IF(AND(L89=\"WIN\",L90<>\"WIN\"),SUMIF(L$24:L89,\"WIN\",K$24:K89)-SUM(W$23:W88),\"\")","v":147.14187749374196},{"$f":"IF(AND(L89=\"LOSS\",L90<>\"LOSS\"),SUMIF(L$24:L89,\"LOSS\",K$24:K89)-SUM(X$23:X88),\"\")","v":""}]
[null,"Row 90 (67)",null,93.951930848645475,null,{"$f":"IF(COUNTBLANK($F$6:$F$10),\"\",IF(D89<$F$8,(1+$F$7*$F$9)*F89-$F$10,(1-$F$7)*F89-$F$10))","v":12408.96500197227},null,124.08965001972271,null,null,{"$f":"IF(COUNTBLANK($F$6:$F$10),\"\", IF(L90=\"win\", H90*$F$9-$F$10, IF(L90=\"loss\", -H90-$F$10)))","v":-124.08965001972271},"LOSS",{"$f":"IF(COUNTA($F$6:$F$10)=5,(F91-F24)/F24,\"\")","v":0.22848753519525472},1,"new",null,null,null,null,null,null,null,{"$f":"IF(AND(L90=\"WIN\",L91<>\"WIN\"),SUMIF(L$24:L90,\"WIN\",K$24:K90)-SUM(W$23:W89),\"\")","v":""},{"$f":"IF(AND(L90=\"LOSS\",L91<>\"LOSS\"),SUMIF(L$24:L90,\"LOSS\",K$24:K90)-SUM(X$23:X89),\"\")","v":""}]
[null,"Row 91 (68)",null,84.861434798306107,null,12284.875351952547,null,122.84875351952547,null,null,-122.84875351952547,"LOSS",{"$f":"IF(COUNTA($F$6:$F$10)=5,(F92-F24)/F24,\"\")","v":0.21620265984330217},2,"last",null,null,null,null,null,null,null,{"$f":"IF(AND(L91=\"WIN\",L92<>\"WIN\"),SUMIF(L$24:L91,\"WIN\",K$24:K91)-SUM(W$23:W90),\"\")","v":""},{"$f":"IF(AND(L91=\"LOSS\",L92<>\"LOSS\"),SUMIF(L$24:L91,\"LOSS\",K$24:K91)-SUM(X$23:X90),\"\")","v":-246.93840353924816}]
[null,"Row 92 (69)",null,34.734625047061904,null,12162.026598433022,null,121.62026598433022,null,null,145.94431918119625,"WIN",{"$f":"IF(COUNTA($F$6:$F$10)=5,(F93-F24)/F24,\"\")","v":0.23079709176142188},1,"new",null,null,null,null,null,null,null,{"$f":"IF(AND(L92=\"WIN\",L93<>\"WIN\"),SUMIF(L$24:L92,\"WIN\",K$24:K92)-SUM(W$23:W91),\"\")","v":""},{"$f":"IF(AND(L92=\"LOSS\",L93<>\"LOSS\"),SUMIF(L$24:L92,\"LOSS\",K$24:K92)-SUM(X$23:X91),\"\")","v":""}]
[null,"Row 93 (70)",null,51.468197679065874,null,12307.970917614219,null,123.07970917614219,null,null,147.69565101137061,"WIN",{"$f":"IF(COUNTA($F$6:$F$10)=5,(F94-F24)/F24,\"\")","v":0.24556665686255891},2,"middle",null,null,null,null,null,null,null,{"$f":"IF(AND(L93=\"WIN\",L94<>\"WIN\"),SUMIF(L$24:L93,\"WIN\",K$24:K93)-SUM(W$23:W92),\"\")","v":""},{"$f":"IF(AND(L93=\"LOSS\",L94<>\"LOSS\"),SUMIF(L$24:L93,\"LOSS\",K$24:K93)-SUM(X$23:X92),\"\")","v":""}]
[null,"Row 94 (71)",null,1.5025174883442904,null,12455.666568625589,null,124.5566656862559,null,null,149.46799882350706,"WIN",{"$f":"IF(COUNTA($F$6:$F$10)=5,(F95-F24)/F24,\"\")","v":0.26051345674490967},3,"middle",null,null,null,null,null,null,null,{"$f":"IF(AND(L94=\"WIN\",L95<>\"WIN\"),SUMIF(L$24:L94,\"WIN\",K$24:K94)-SUM(W$23:W93),\"\")","v":""},{"$f":"IF(AND(L94=\"LOSS\",L95<>\"LOSS\"),SUMIF(L$24:L94,\"LOSS\",K$24:K94)-SUM(X$23:X93),\"\")","v":""}]
[null,"Row 95 (72)",null,51.720597650829525,null,12605.134567449097,null,126.05134567449097,null,null,151.26161480938916,"WIN",{"$f":"IF(COUNTA($F$6:$F$10)=5,(F96-F24)/F24,\"\")","v":0.27563961822584859},4,"last",null,null,null,null,null,null,null,{"$f":"IF(AND(L95=\"WIN\",L96<>\"WIN\"),SUMIF(L$24:L95,\"WIN\",K$24:K95)-SUM(W$23:W94),\"\")","v":594.36958382546345},{"$f":"IF(AND(L95=\"LOSS\",L96<>\"LOSS\"),SUMIF(L$24:L95,\"LOSS\",K$24:K95)-SUM(X$23:X94),\"\")","v":""}]
[null,"Row 96 (73)",null,81.083278860248782,null,12756.396182258486,null,127.56396182258486,null,null,-127.56396182258486,"LOSS",{"$f":"IF(COUNTA($F$6:$F$10)=5,(F97-F24)/F24,\"\")","v":0.2628832220435901},1,"new",null,null,null,null,null,null,null,{"$f":"IF(AND(L96=\"WIN\",L97<>\"WIN\"),SUMIF(L$24:L96,\"WIN\",K$24:K96)-SUM(W$23:W95),\"\")","v":""},{"$f":"IF(AND(L96=\"LOSS\",L97<>\"LOSS\"),SUMIF(L$24:L96,\"LOSS\",K$24:K96)-SUM(X$23:X95),\"\")","v":""}]
[null,"Row 97 (74)",null,86.722557611719225,null,12628.832220435901,null,126.28832220435902,null,null,-126.28832220435902,"LOSS",{"$f":"IF(COUNTA($F$6:$F$10)=5,(F98-F24)/F24,\"\")","v":0.25025438982315429},2,"last",null,null,null,null,null,null,null,{"$f":"IF(AND(L97=\"WIN\",L98<>\"WIN\"),SUMIF(L$24:L97,\"WIN\",K$24:K97)-SUM(W$23:W96),\"\")","v":""},{"$f":"IF(AND(L97=\"LOSS\",L98<>\"LOSS\"),SUMIF(L$24:L97,\"LOSS\",K$24:K97)-SUM(X$23:X96),\"\")","v":-253.85228402694429}]
[null,"Row 98 (75)",null,18.664109023071983,null,12502.543898231543,null,125.02543898231544,null,null,150.03052677877852,"WIN",{"$f":"IF(COUNTA($F$6:$F$10)=5,(F99-F24)/F24,\"\")","v":0.26525744250103217},1,"last",null,null,null,null,null,null,null,{"$f":"IF(AND(L98=\"WIN\",L99<>\"WIN\"),SUMIF(L$24:L98,\"WIN\",K$24:K98)-SUM(W$23:W97),\"\")","v":150.03052677877895},{"$f":"IF(AND(L98=\"LOSS\",L99<>\"LOSS\"),SUMIF(L$24:L98,\"LOSS\",K$24:K98)-SUM(X$23:X97),\"\")","v":""}]
[null,"Row 99 (76)",null,77.52337765864597,null,12652.574425010322,null,126.52574425010322,null,null,-126.52574425010322,"LOSS",{"$f":"IF(COUNTA($F$6:$F$10)=5,(F100-F24)/F24,\"\")","v":0.25260486807602195},1,"new",null,null,null,null,null,null,null,{"$f":"IF(AND(L99=\"WIN\",L100<>\"WIN\"),SUMIF(L$24:L99,\"WIN\",K$24:K99)-SUM(W$23:W98),\"\")","v":""},{"$f":"IF(AND(L99=\"LOSS\",L100<>\"LOSS\"),SUMIF(L$24:L99,\"LOSS\",K$24:K99)-SUM(X$23:X98),\"\")","v":""}]
[null,"Row 100 (77)",null,55.205899177229732,null,12526.048680760219,null,125.26048680760219,null,null,-125.26048680760219,"LOSS",{"$f":"IF(COUNTA($F$6:$F$10)=5,(F101-F24)/F24,\"\")","v":0.24007881939526177},2,"middle",null,null,null,null,null,null,null,{"$f":"IF(AND(L100=\"WIN\",L101<>\"WIN\"),SUMIF(L$24:L100,\"WIN\",K$24:K100)-SUM(W$23:W99),\"\")","v":""},{"$f":"IF(AND(L100=\"LOSS\",L101<>\"LOSS\"),SUMIF(L$24:L100,\"LOSS\",K$24:K100)-SUM(X$23:X99),\"\")","v":""}]
[null,"Row 101 (78)",null,69.533409016572037,null,12400.788193952618,null,124.00788193952619,null,null,-124.00788193952619,"LOSS",{"$f":"IF(COUNTA($F$6:$F$10)=5,(F102-F24)/F24,\"\")","v":0.22767803120130919},3,"last",null,null,null,null,null,null,null,{"$f":"IF(AND(L101=\"WIN\",L102<>\"WIN\"),SUMIF(L$24:L101,\"WIN\",K$24:K101)-SUM(W$23:W100),\"\")","v":""},{"$f":"IF(AND(L101=\"LOSS\",L102<>\"LOSS\"),SUMIF(L$24:L101,\"LOSS\",K$24:K101)-SUM(X$23:X100),\"\")","v":-375.79411299723188}]
[null,"Row 102 (79)",null,13.239322686646693,null,12276.780312013092,null,122.76780312013092,null,null,147.32136374415711,"WIN",{"$f":"IF(COUNTA($F$6:$F$10)=5,(F103-F24)/F24,\"\")","v":0.24241016757572489},1,"last",null,null,null,null,null,null,null,{"$f":"IF(AND(L102=\"WIN\",L103<>\"WIN\"),SUMIF(L$24:L102,\"WIN\",K$24:K102)-SUM(W$23:W101),\"\")","v":147.32136374415677},{"$f":"IF(AND(L102=\"LOSS\",L103<>\"LOSS\"),SUMIF(L$24:L102,\"LOSS\",K$24:K102)-SUM(X$23:X101),\"\")","v":""}]
[null,"Row 103 (80)",null,70.834071054203633,null,12424.101675757249,null,124.2410167575725,null,null,-124.2410167575725,"LOSS",{"$f":"IF(COUNTA($F$6:$F$10)=5,(F104-F24)/F24,\"\")","v":0.22998606589996762},1,"last",null,null,null,null,null,null,null,{"$f":"IF(AND(L103=\"WIN\",L104<>\"WIN\"),SUMIF(L$24:L103,\"WIN\",K$24:K103)-SUM(W$23:W102),\"\")","v":""},{"$f":"IF(AND(L103=\"LOSS\",L104<>\"LOSS\"),SUMIF(L$24:L103,\"LOSS\",K$24:K103)-SUM(X$23:X102),\"\")","v":-124.24101675757265}]
[null,"Row 104 (81)",null,38.962487574913439,null,12299.860658999676,null,122.99860658999677,null,null,147.59832790799612,"WIN",{"$f":"IF(COUNTA($F$6:$F$10)=5,(F105-F24)/F24,\"\")","v":0.24474589869076718},1,"last",null,null,null,null,null,null,null,{"$f":"IF(AND(L104=\"WIN\",L105<>\"WIN\"),SUMIF(L$24:L104,\"WIN\",K$24:K104)-SUM(W$23:W103),\"\")","v":147.59832790799646},{"$f":"IF(AND(L104=\"LOSS\",L105<>\"LOSS\"),SUMIF(L$24:L104,\"LOSS\",K$24:K104)-SUM(X$23:X103),\"\")","v":""}]
[null,"Row 105 (82)",null,57.957790426652188,null,12447.458986907672,null,124.47458986907672,null,null,-124.47458986907672,"LOSS",{"$f":"IF(COUNTA($F$6:$F$10)=5,(F106-F24)/F24,\"\")","v":0.23229843970385955},1,"new",null,null,null,null,null,null,null,{"$f":"IF(AND(L105=\"WIN\",L106<>\"WIN\"),SUMIF(L$24:L105,\"WIN\",K$24:K105)-SUM(W$23:W104),\"\")","v":""},{"$f":"IF(AND(L105=\"LOSS\",L106<>\"LOSS\"),SUMIF(L$24:L105,\"LOSS\",K$24:K105)-SUM(X$23:X104),\"\")","v":""}]
[null,"Row 106 (83)",null,72.367275194594399,null,12322.984397038595,null,123.22984397038596,null,null,-123.22984397038596,"LOSS",{"$f":"IF(COUNTA($F$6:$F$10)=5,(F107-F24)/F24,\"\")","v":0.21997545530682092},2,"last",null,null,null,null,null,null,null,{"$f":"IF(AND(L106=\"WIN\",L107<>\"WIN\"),SUMIF(L$24:L106,\"WIN\",K$24:K106)-SUM(W$23:W105),\"\")","v":""},{"$f":"IF(AND(L106=\"LOSS\",L107<>\"LOSS\"),SUMIF(L$24:L106,\"LOSS\",K$24:K106)-SUM(X$23:X105),\"\")","v":-247.70443383946304}]
[null,"Row 107 (84)",null,25.099088403100687,null,12199.754553068209,null,121.99754553068209,null,null,146.3970546368185,"WIN",{"$f":"IF(COUNTA($F$6:$F$10)=5,(F108-F24)/F24,\"\")","v":0.23461516077050273},1,"new",null,null,null,null,null,null,null,{"$f":"IF(AND(L107=\"WIN\",L108<>\"WIN\"),SUMIF(L$24:L107,\"WIN\",K$24:K107)-SUM(W$23:W106),\"\")","v":""},{"$f":"IF(AND(L107=\"LOSS\",L108<>\"LOSS\"),SUMIF(L$24:L107,\"LOSS\",K$24:K107)-SUM(X$23:X106),\"\")","v":""}]
[null,"Row 108 (85)",null,41.300027249792407,null,12346.151607705027,null,123.46151607705028,null,null,148.15381929246033,"WIN",{"$f":"IF(COUNTA($F$6:$F$10)=5,(F109-F24)/F24,\"\")","v":0.24943054269974874},2,"middle",null,null,null,null,null,null,null,{"$f":"IF(AND(L108=\"WIN\",L109<>\"WIN\"),SUMIF(L$24:L108,\"WIN\",K$24:K108)-SUM(W$23:W107),\"\")","v":""},{"$f":"IF(AND(L108=\"LOSS\",L109<>\"LOSS\"),SUMIF(L$24:L108,\"LOSS\",K$24:K108)-SUM(X$23:X107),\"\")","v":""}]
[null,"Row 109 (86)",null,51.031778990024932,null,12494.305426997487,null,124.94305426997488,null,null,149.93166512396985,"WIN",{"$f":"IF(COUNTA($F$6:$F$10)=5,(F110-F24)/F24,\"\")","v":0.2644237092121457},3,"middle",null,null,null,null,null,null,null,{"$f":"IF(AND(L109=\"WIN\",L110<>\"WIN\"),SUMIF(L$24:L109,\"WIN\",K$24:K109)-SUM(W$23:W108),\"\")","v":""},{"$f":"IF(AND(L109=\"LOSS\",L110<>\"LOSS\"),SUMIF(L$24:L109,\"LOSS\",K$24:K109)-SUM(X$23:X108),\"\")","v":""}]
[null,"Row 110 (87)",null,10.182063695408816,null,12644.237092121457,null,126.44237092121458,null,null,151.73084510545749,"WIN",{"$f":"IF(COUNTA($F$6:$F$10)=5,(F111-F24)/F24,\"\")","v":0.27959679372269147},4,"middle",null,null,null,null,null,null,null,{"$f":"IF(AND(L110=\"WIN\",L111<>\"WIN\"),SUMIF(L$24:L110,\"WIN\",K$24:K110)-SUM(W$23:W109),\"\")","v":""},{"$f":"IF(AND(L110=\"LOSS\",L111<>\"LOSS\"),SUMIF(L$24:L110,\"LOSS\",K$24:K110)-SUM(X$23:X109),\"\")","v":""}]
[null,"Row 111 (88)",null,3.0662858409212013,null,12795.967937226915,null,127.95967937226915,null,null,153.55161524672297,"WIN",{"$f":"IF(COUNTA($F$6:$F$10)=5,(F112-F24)/F24,\"\")","v":0.29495195524736373},5,"last",null,null,null,null,null,null,null,{"$f":"IF(AND(L111=\"WIN\",L112<>\"WIN\"),SUMIF(L$24:L111,\"WIN\",K$24:K111)-SUM(W$23:W110),\"\")","v":749.76499940542817},{"$f":"IF(AND(L111=\"LOSS\",L112<>\"LOSS\"),SUMIF(L$24:L111,\"LOSS\",K$24:K111)-SUM(X$23:X110),\"\")","v":""}]
[null,"Row 112 (89)",null,61.259359421141077,null,12949.519552473637,null,129.49519552473637,null,null,-129.49519552473637,"LOSS",{"$f":"IF(COUNTA($F$6:$F$10)=5,(F113-F24)/F24,\"\")","v":0.28200243569489014},1,"last",null,null,null,null,null,null,null,{"$f":"IF(AND(L112=\"WIN\",L113<>\"WIN\"),SUMIF(L$24:L112,\"WIN\",K$24:K112)-SUM(W$23:W111),\"\")","v":""},{"$f":"IF(AND(L112=\"LOSS\",L113<>\"LOSS\"),SUMIF(L$24:L112,\"LOSS\",K$24:K112)-SUM(X$23:X111),\"\")","v":-129.49519552473612}]
[null,"Row 113 (90)",null,3.4038430619199533,null,12820.024356948901,null,128.200243569489,null,null,153.84029228338679,"WIN",{"$f":"IF(COUNTA($F$6:$F$10)=5,(F114-F24)/F24,\"\")","v":0.29738646492322879},1,"new",null,null,null,null,null,null,null,{"$f":"IF(AND(L113=\"WIN\",L114<>\"WIN\"),SUMIF(L$24:L113,\"WIN\",K$24:K113)-SUM(W$23:W112),\"\")","v":""},{"$f":"IF(AND(L113=\"LOSS\",L114<>\"LOSS\"),SUMIF(L$24:L113,\"LOSS\",K$24:K113)-SUM(X$23:X112),\"\")","v":""}]
[null,"Row 114 (91)",null,9.2261324425846336E-2,null,12973.864649232288,null,129.73864649232289,null,null,155.68637579078745,"WIN",{"$f":"IF(COUNTA($F$6:$F$10)=5,(F115-F24)/F24,\"\")","v":0.31295510250230746},2,"last",null,null,null,null,null,null,null,{"$f":"IF(AND(L114=\"WIN\",L115<>\"WIN\"),SUMIF(L$24:L114,\"WIN\",K$24:K114)-SUM(W$23:W113),\"\")","v":309.52666807417427},{"$f":"IF(AND(L114=\"LOSS\",L115<>\"LOSS\"),SUMIF(L$24:L114,\"LOSS\",K$24:K114)-SUM(X$23:X113),\"\")","v":""}]
[null,"Row 115 (92)",null,90.906021098892566,null,13129.551025023075,null,131.29551025023073,null,null,-131.29551025023073,"LOSS",{"$f":"IF(COUNTA($F$6:$F$10)=5,(F116-F24)/F24,\"\")","v":0.29982555147728435},1,"new",null,null,null,null,null,null,null,{"$f":"IF(AND(L115=\"WIN\",L116<>\"WIN\"),SUMIF(L$24:L115,\"WIN\",K$24:K115)-SUM(W$23:W114),\"\")","v":""},{"$f":"IF(AND(L115=\"LOSS\",L116<>\"LOSS\"),SUMIF(L$24:L115,\"LOSS\",K$24:K115)-SUM(X$23:X114),\"\")","v":""}]
[null,"Row 116 (93)",null,82.640643834291311,null,12998.255514772844,null,129.98255514772845,null,null,-129.98255514772845,"LOSS",{"$f":"IF(COUNTA($F$6:$F$10)=5,(F117-F24)/F24,\"\")","v":0.28682729596251155},2,"last",null,null,null,null,null,null,null,{"$f":"IF(AND(L116=\"WIN\",L117<>\"WIN\"),SUMIF(L$24:L116,\"WIN\",K$24:K116)-SUM(W$23:W115),\"\")","v":""},{"$f":"IF(AND(L116=\"LOSS\",L117<>\"LOSS\"),SUMIF(L$24:L116,\"LOSS\",K$24:K116)-SUM(X$23:X115),\"\")","v":-261.27806539795984}]
[null,"Row 117 (94)",null,1.8142939670799163,null,12868.272959625116,null,128.68272959625116,null,null,154.4192755155014,"WIN",{"$f":"IF(COUNTA($F$6:$F$10)=5,(F118-F24)/F24,\"\")","v":0.30226922351406177},1,"new",null,null,null,null,null,null,null,{"$f":"IF(AND(L117=\"WIN\",L118<>\"WIN\"),SUMIF(L$24:L117,\"WIN\",K$24:K117)-SUM(W$23:W116),\"\")","v":""},{"$f":"IF(AND(L117=\"LOSS\",L118<>\"LOSS\"),SUMIF(L$24:L117,\"LOSS\",K$24:K117)-SUM(X$23:X116),\"\")","v":""}]
[null,"Row 118 (95)",null,14.819217851998234,null,13022.692235140617,null,130.22692235140619,null,null,156.27230682168741,"WIN",{"$f":"IF(COUNTA($F$6:$F$10)=5,(F119-F24)/F24,\"\")","v":0.31789645419623047},2,"middle",null,null,null,null,null,null,null,{"$f":"IF(AND(L118=\"WIN\",L119<>\"WIN\"),SUMIF(L$24:L118,\"WIN\",K$24:K118)-SUM(W$23:W117),\"\")","v":""},{"$f":"IF(AND(L118=\"LOSS\",L119<>\"LOSS\"),SUMIF(L$24:L118,\"LOSS\",K$24:K118)-SUM(X$23:X117),\"\")","v":""}]
[null,"Row 119 (96)",null,33.265175928580916,null,13178.964541962305,null,131.78964541962304,null,null,158.14757450354765,"WIN",{"$f":"IF(COUNTA($F$6:$F$10)=5,(F120-F24)/F24,\"\")","v":0.33371121164658524},3,"last",null,null,null,null,null,null,null,{"$f":"IF(AND(L119=\"WIN\",L120<>\"WIN\"),SUMIF(L$24:L119,\"WIN\",K$24:K119)-SUM(W$23:W118),\"\")","v":468.8391568407369},{"$f":"IF(AND(L119=\"LOSS\",L120<>\"LOSS\"),SUMIF(L$24:L119,\"LOSS\",K$24:K119)-SUM(X$23:X118),\"\")","v":""}]
[null,"Row 120 (97)",null,92.12649996622838,null,13337.112116465853,null,133.37112116465852,null,null,-133.37112116465852,"LOSS",{"$f":"IF(COUNTA($F$6:$F$10)=5,(F121-F24)/F24,\"\")","v":0.32037409953011936},1,"new",null,null,null,null,null,null,null,{"$f":"IF(AND(L120=\"WIN\",L121<>\"WIN\"),SUMIF(L$24:L120,\"WIN\",K$24:K120)-SUM(W$23:W119),\"\")","v":""},{"$f":"IF(AND(L120=\"LOSS\",L121<>\"LOSS\"),SUMIF(L$24:L120,\"LOSS\",K$24:K120)-SUM(X$23:X119),\"\")","v":""}]
[null,"Row 121 (98)",null,68.886955629204621,null,13203.740995301194,null,132.03740995301195,null,null,-132.03740995301195,"LOSS",{"$f":"IF(COUNTA($F$6:$F$10)=5,(F122-F24)/F24,\"\")","v":0.30717035853481811},2,"middle",null,null,null,null,null,null,null,{"$f":"IF(AND(L121=\"WIN\",L122<>\"WIN\"),SUMIF(L$24:L121,\"WIN\",K$24:K121)-SUM(W$23:W120),\"\")","v":""},{"$f":"IF(AND(L121=\"LOSS\",L122<>\"LOSS\"),SUMIF(L$24:L121,\"LOSS\",K$24:K121)-SUM(X$23:X120),\"\")","v":""}]
[null,"Row 122 (99)",null,76.342429669563643,null,13071.703585348181,null,130.7170358534818,null,null,-130.7170358534818,"LOSS",{"$f":"IF(COUNTA($F$6:$F$10)=5,(F123-F24)/F24,\"\")","v":0.29409865494946991},3,"middle",null,null,null,null,null,null,null,{"$f":"IF(AND(L122=\"WIN\",L123<>\"WIN\"),SUMIF(L$24:L122,\"WIN\",K$24:K122)-SUM(W$23:W121),\"\")","v":""},{"$f":"IF(AND(L122=\"LOSS\",L123<>\"LOSS\"),SUMIF(L$24:L122,\"LOSS\",K$24:K122)-SUM(X$23:X121),\"\")","v":""}]
[null,"Row 123 (100)",null,58.897202287710449,null,12940.986549494699,null,129.40986549494698,null,null,-129.40986549494698,"LOSS",{"$f":"IF(COUNTA($F$6:$F$10)=5,(F124-F24)/F24,\"\")","v":0.28115766839997525},4,"last",null,null,null,null,null,null,null,{"$f":"IF(AND(L123=\"WIN\",L124<>\"WIN\"),SUMIF(L$24:L123,\"WIN\",K$24:K123)-SUM(W$23:W122),\"\")","v":""},{"$f":"IF(AND(L123=\"LOSS\",L124<>\"LOSS\"),SUMIF(L$24:L123,\"LOSS\",K$24:K123)-SUM(X$23:X122),\"\")","v":-525.53543246609934}]
[null,"Row 124 (101)",null,39.136775097251672,null,12811.576683999752,null,128.11576683999752,null,null,153.73892020799701,"WIN",{"$f":"IF(COUNTA($F$6:$F$10)=5,(F125-F24)/F24,\"\")","v":0.296531560420775},1,"new",null,null,null,null,null,null,null,{"$f":"IF(AND(L124=\"WIN\",L125<>\"WIN\"),SUMIF(L$24:L124,\"WIN\",K$24:K124)-SUM(W$23:W123),\"\")","v":""},{"$f":"IF(AND(L124=\"LOSS\",L125<>\"LOSS\"),SUMIF(L$24:L124,\"LOSS\",K$24:K124)-SUM(X$23:X123),\"\")","v":""}]
[null,"Row 125 (102)",null,53.854417962472986,null,12965.31560420775,null,129.65315604207751,null,null,155.583787250493,"WIN",{"$f":"IF(COUNTA($F$6:$F$10)=5,(F126-F24)/F24,\"\")","v":0.31208993914582422},2,"last",null,null,null,null,null,null,null,{"$f":"IF(AND(L125=\"WIN\",L126<>\"WIN\"),SUMIF(L$24:L125,\"WIN\",K$24:K125)-SUM(W$23:W124),\"\")","v":309.32270745849019},{"$f":"IF(AND(L125=\"LOSS\",L126<>\"LOSS\"),SUMIF(L$24:L125,\"LOSS\",K$24:K125)-SUM(X$23:X124),\"\")","v":""}]
[null,"Row 126 (103)",null,56.327464385734295,null,13120.899391458242,null,131.20899391458244,null,null,-131.20899391458244,"LOSS",{"$f":"IF(COUNTA($F$6:$F$10)=5,(F127-F24)/F24,\"\")","v":0.29896903975436601},1,"new",null,null,null,null,null,null,null,{"$f":"IF(AND(L126=\"WIN\",L127<>\"WIN\"),SUMIF(L$24:L126,\"WIN\",K$24:K126)-SUM(W$23:W125),\"\")","v":""},{"$f":"IF(AND(L126=\"LOSS\",L127<>\"LOSS\"),SUMIF(L$24:L126,\"LOSS\",K$24:K126)-SUM(X$23:X125),\"\")","v":""}]
[null,"Row 127 (104)",null,63.869576833066198,null,12989.69039754366,null,129.8969039754366,null,null,-129.8969039754366,"LOSS",{"$f":"IF(COUNTA($F$6:$F$10)=5,(F128-F24)/F24,\"\")","v":0.28597934935682223},2,"last",null,null,null,null,null,null,null,{"$f":"IF(AND(L127=\"WIN\",L128<>\"WIN\"),SUMIF(L$24:L127,\"WIN\",K$24:K127)-SUM(W$23:W126),\"\")","v":""},{"$f":"IF(AND(L127=\"LOSS\",L128<>\"LOSS\"),SUMIF(L$24:L127,\"LOSS\",K$24:K127)-SUM(X$23:X126),\"\")","v":-261.10589789001915}]
[null,"Row 128 (105)",null,24.620450450269761,null,12859.793493568222,null,128.59793493568222,null,null,154.31752192281866,"WIN",{"$f":"IF(COUNTA($F$6:$F$10)=5,(F129-F24)/F24,\"\")","v":0.30141110154910422},1,"new",null,null,null,null,null,null,null,{"$f":"IF(AND(L128=\"WIN\",L129<>\"WIN\"),SUMIF(L$24:L128,\"WIN\",K$24:K128)-SUM(W$23:W127),\"\")","v":""},{"$f":"IF(AND(L128=\"LOSS\",L129<>\"LOSS\"),SUMIF(L$24:L128,\"LOSS\",K$24:K128)-SUM(X$23:X127),\"\")","v":""}]
[null,"Row 129 (106)",null,11.584972776576386,null,13014.111015491042,null,130.14111015491042,null,null,156.1693321858925,"WIN",{"$f":"IF(COUNTA($F$6:$F$10)=5,(F130-F24)/F24,\"\")","v":0.31702803476769348},2,"last",null,null,null,null,null,null,null,{"$f":"IF(AND(L129=\"WIN\",L130<>\"WIN\"),SUMIF(L$24:L129,\"WIN\",K$24:K129)-SUM(W$23:W128),\"\")","v":310.48685410871076},{"$f":"IF(AND(L129=\"LOSS\",L130<>\"LOSS\"),SUMIF(L$24:L129,\"LOSS\",K$24:K129)-SUM(X$23:X128),\"\")","v":""}]
[null,"Row 130 (107)",null,85.240964393552289,null,13170.280347676935,null,131.70280347676936,null,null,-131.70280347676936,"LOSS",{"$f":"IF(COUNTA($F$6:$F$10)=5,(F131-F24)/F24,\"\")","v":0.3038577544200165},1,"new",null,null,null,null,null,null,null,{"$f":"IF(AND(L130=\"WIN\",L131<>\"WIN\"),SUMIF(L$24:L130,\"WIN\",K$24:K130)-SUM(W$23:W129),\"\")","v":""},{"$f":"IF(AND(L130=\"LOSS\",L131<>\"LOSS\"),SUMIF(L$24:L130,\"LOSS\",K$24:K130)-SUM(X$23:X129),\"\")","v":""}]
[null,"Row 131 (108)",null,91.292732243124746,null,13038.577544200165,null,130.38577544200166,null,null,-130.38577544200166,"LOSS",{"$f":"IF(COUNTA($F$6:$F$10)=5,(F132-F24)/F24,\"\")","v":0.29081917687581627},2,"middle",null,null,null,null,null,null,null,{"$f":"IF(AND(L131=\"WIN\",L132<>\"WIN\"),SUMIF(L$24:L131,\"WIN\",K$24:K131)-SUM(W$23:W130),\"\")","v":""},{"$f":"IF(AND(L131=\"LOSS\",L132<>\"LOSS\"),SUMIF(L$24:L131,\"LOSS\",K$24:K131)-SUM(X$23:X130),\"\")","v":""},null,"Distribution and Reprint Policy"]
[null,"Row 132 (109)",null,66.391013887290228,null,12908.191768758163,null,129.08191768758164,null,null,-129.08191768758164,"LOSS",{"$f":"IF(COUNTA($F$6:$F$10)=5,(F133-F24)/F24,\"\")","v":0.27791098510705814},3,"middle",null,null,null,null,null,null,null,{"$f":"IF(AND(L132=\"WIN\",L133<>\"WIN\"),SUMIF(L$24:L132,\"WIN\",K$24:K132)-SUM(W$23:W131),\"\")","v":""},{"$f":"IF(AND(L132=\"LOSS\",L133<>\"LOSS\"),SUMIF(L$24:L132,\"LOSS\",K$24:K132)-SUM(X$23:X131),\"\")","v":""},null,"This document maybe be republished and distributed under the proviso that it cannot be altered or amended."]
[null,"Row 133 (110)",null,81.273243750361544,null,12779.109851070581,null,127.79109851070582,null,null,-127.79109851070582,"LOSS",{"$f":"IF(COUNTA($F$6:$F$10)=5,(F134-F24)/F24,\"\")","v":0.26513187525598753},4,"last",null,null,null,null,null,null,null,{"$f":"IF(AND(L133=\"WIN\",L134<>\"WIN\"),SUMIF(L$24:L133,\"WIN\",K$24:K133)-SUM(W$23:W132),\"\")","v":""},{"$f":"IF(AND(L133=\"LOSS\",L134<>\"LOSS\"),SUMIF(L$24:L133,\"LOSS\",K$24:K133)-SUM(X$23:X132),\"\")","v":-518.9615951170581},null,"DayTradingLife.com Reserve all rights to this effect. "]
[null,"Row 134 (111)",null,24.403512367386217,null,12651.318752559875,null,126.51318752559875,null,null,151.81582503071849,"WIN",{"$f":"IF(COUNTA($F$6:$F$10)=5,(F135-F24)/F24,\"\")","v":0.28031345775905936},1,"last",null,null,null,null,null,null,null,{"$f":"IF(AND(L134=\"WIN\",L135<>\"WIN\"),SUMIF(L$24:L134,\"WIN\",K$24:K134)-SUM(W$23:W133),\"\")","v":151.81582503071877},{"$f":"IF(AND(L134=\"LOSS\",L135<>\"LOSS\"),SUMIF(L$24:L134,\"LOSS\",K$24:K134)-SUM(X$23:X133),\"\")","v":""},null,null,"For any futher information please email me at: ",null,null,null,null,null,null,"traderdowboy@gmail.com"]
[null,"Row 135 (112)",null,88.495288866637139,null,12803.134577590594,null,128.03134577590595,null,null,-128.03134577590595,"LOSS",{"$f":"IF(COUNTA($F$6:$F$10)=5,(F136-F24)/F24,\"\")","v":0.26751032318146883},1,"last",null,null,null,null,null,null,null,{"$f":"IF(AND(L135=\"WIN\",L136<>\"WIN\"),SUMIF(L$24:L135,\"WIN\",K$24:K135)-SUM(W$23:W134),\"\")","v":""},{"$f":"IF(AND(L135=\"LOSS\",L136<>\"LOSS\"),SUMIF(L$24:L135,\"LOSS\",K$24:K135)-SUM(X$23:X134),\"\")","v":-128.03134577590572},null,"Copyright © 2011-2012 - DayTradingLife.com. - All rights reserved."]
[null,"Row 136 (113)",null,35.763555651329312,null,12675.103231814688,null,126.75103231814688,null,null,152.10123878177626,"WIN",{"$f":"IF(COUNTA($F$6:$F$10)=5,(F137-F24)/F24,\"\")","v":0.28272044705964655},1,"last",null,null,null,null,null,null,null,{"$f":"IF(AND(L136=\"WIN\",L137<>\"WIN\"),SUMIF(L$24:L136,\"WIN\",K$24:K136)-SUM(W$23:W135),\"\")","v":152.10123878177546},{"$f":"IF(AND(L136=\"LOSS\",L137<>\"LOSS\"),SUMIF(L$24:L136,\"LOSS\",K$24:K136)-SUM(X$23:X135),\"\")","v":""}]
[null,"Row 137 (114)",null,82.173275925581422,null,12827.204470596465,null,128.27204470596465,null,null,-128.27204470596465,"LOSS",{"$f":"IF(COUNTA($F$6:$F$10)=5,(F138-F24)/F24,\"\")","v":0.26989324258905001},1,"last",null,null,null,null,null,null,null,{"$f":"IF(AND(L137=\"WIN\",L138<>\"WIN\"),SUMIF(L$24:L137,\"WIN\",K$24:K137)-SUM(W$23:W136),\"\")","v":""},{"$f":"IF(AND(L137=\"LOSS\",L138<>\"LOSS\"),SUMIF(L$24:L137,\"LOSS\",K$24:K137)-SUM(X$23:X136),\"\")","v":-128.27204470596462}]
[null,"Row 138 (115)",null,28.028799936609861,null,12698.9324258905,null,126.989324258905,null,null,152.38718911068599,"WIN",{"$f":"IF(COUNTA($F$6:$F$10)=5,(F139-F24)/F24,\"\")","v":0.28513196150011866},1,"last",null,null,null,null,null,null,null,{"$f":"IF(AND(L138=\"WIN\",L139<>\"WIN\"),SUMIF(L$24:L138,\"WIN\",K$24:K138)-SUM(W$23:W137),\"\")","v":152.38718911068645},{"$f":"IF(AND(L138=\"LOSS\",L139<>\"LOSS\"),SUMIF(L$24:L138,\"LOSS\",K$24:K138)-SUM(X$23:X137),\"\")","v":""}]
[null,"Row 139 (116)",null,99.727784925208582,null,12851.319615001186,null,128.51319615001188,null,null,-128.51319615001188,"LOSS",{"$f":"IF(COUNTA($F$6:$F$10)=5,(F140-F24)/F24,\"\")","v":0.27228064188511741},1,"last",null,null,null,null,null,null,null,{"$f":"IF(AND(L139=\"WIN\",L140<>\"WIN\"),SUMIF(L$24:L139,\"WIN\",K$24:K139)-SUM(W$23:W138),\"\")","v":""},{"$f":"IF(AND(L139=\"LOSS\",L140<>\"LOSS\"),SUMIF(L$24:L139,\"LOSS\",K$24:K139)-SUM(X$23:X138),\"\")","v":-128.51319615001194}]
[null,"Row 140 (117)",null,48.711244391455942,null,12722.806418851174,null,127.22806418851175,null,null,152.67367702621411,"WIN",{"$f":"IF(COUNTA($F$6:$F$10)=5,(F141-F24)/F24,\"\")","v":0.28754800958773885},1,"last",null,null,null,null,null,null,null,{"$f":"IF(AND(L140=\"WIN\",L141<>\"WIN\"),SUMIF(L$24:L140,\"WIN\",K$24:K140)-SUM(W$23:W139),\"\")","v":152.67367702621414},{"$f":"IF(AND(L140=\"LOSS\",L141<>\"LOSS\"),SUMIF(L$24:L140,\"LOSS\",K$24:K140)-SUM(X$23:X139),\"\")","v":""}]
[null,"Row 141 (118)",null,78.159729024926364,null,12875.480095877389,null,128.7548009587739,null,null,-128.7548009587739,"LOSS",{"$f":"IF(COUNTA($F$6:$F$10)=5,(F142-F24)/F24,\"\")","v":0.27467252949186149},1,"last",null,null,null,null,null,null,null,{"$f":"IF(AND(L141=\"WIN\",L142<>\"WIN\"),SUMIF(L$24:L141,\"WIN\",K$24:K141)-SUM(W$23:W140),\"\")","v":""},{"$f":"IF(AND(L141=\"LOSS\",L142<>\"LOSS\"),SUMIF(L$24:L141,\"LOSS\",K$24:K141)-SUM(X$23:X140),\"\")","v":-128.75480095877356}]
[null,"Row 142 (119)",null,19.971127251039167,null,12746.725294918615,null,127.46725294918615,null,null,152.96070353902337,"WIN",{"$f":"IF(COUNTA($F$6:$F$10)=5,(F143-F24)/F24,\"\")","v":0.28996859984576384},1,"new",null,null,null,null,null,null,null,{"$f":"IF(AND(L142=\"WIN\",L143<>\"WIN\"),SUMIF(L$24:L142,\"WIN\",K$24:K142)-SUM(W$23:W141),\"\")","v":""},{"$f":"IF(AND(L142=\"LOSS\",L143<>\"LOSS\"),SUMIF(L$24:L142,\"LOSS\",K$24:K142)-SUM(X$23:X141),\"\")","v":""}]
[null,"Row 143 (120)",null,19.421301635084841,null,12899.685998457639,null,128.99685998457639,null,null,154.79623198149167,"WIN",{"$f":"IF(COUNTA($F$6:$F$10)=5,(F144-F24)/F24,\"\")","v":0.30544822304391311},2,"last",null,null,null,null,null,null,null,{"$f":"IF(AND(L143=\"WIN\",L144<>\"WIN\"),SUMIF(L$24:L143,\"WIN\",K$24:K143)-SUM(W$23:W142),\"\")","v":307.75693552051598},{"$f":"IF(AND(L143=\"LOSS\",L144<>\"LOSS\"),SUMIF(L$24:L143,\"LOSS\",K$24:K143)-SUM(X$23:X142),\"\")","v":""}]
[null,"Row 144 (121)",null,64.572924444907045,null,13054.482230439131,null,130.54482230439132,null,null,-130.54482230439132,"LOSS",{"$f":"IF(COUNTA($F$6:$F$10)=5,(F145-F24)/F24,\"\")","v":0.29239374081347397},1,"last",null,null,null,null,null,null,null,{"$f":"IF(AND(L144=\"WIN\",L145<>\"WIN\"),SUMIF(L$24:L144,\"WIN\",K$24:K144)-SUM(W$23:W143),\"\")","v":""},{"$f":"IF(AND(L144=\"LOSS\",L145<>\"LOSS\"),SUMIF(L$24:L144,\"LOSS\",K$24:K144)-SUM(X$23:X143),\"\")","v":-130.54482230439135}]
[null,"Row 145 (122)",null,17.605063423697587,null,12923.93740813474,null,129.23937408134739,null,null,155.08724889761686,"WIN",{"$f":"IF(COUNTA($F$6:$F$10)=5,(F146-F24)/F24,\"\")","v":0.30790246570323559},1,"last",null,null,null,null,null,null,null,{"$f":"IF(AND(L145=\"WIN\",L146<>\"WIN\"),SUMIF(L$24:L145,\"WIN\",K$24:K145)-SUM(W$23:W144),\"\")","v":155.08724889761652},{"$f":"IF(AND(L145=\"LOSS\",L146<>\"LOSS\"),SUMIF(L$24:L145,\"LOSS\",K$24:K145)-SUM(X$23:X144),\"\")","v":""}]
[null,"Row 146 (123)",null,86.488519958632892,null,13079.024657032356,null,130.79024657032357,null,null,-130.79024657032357,"LOSS",{"$f":"IF(COUNTA($F$6:$F$10)=5,(F147-F24)/F24,\"\")","v":0.29482344104620334},1,"last",null,null,null,null,null,null,null,{"$f":"IF(AND(L146=\"WIN\",L147<>\"WIN\"),SUMIF(L$24:L146,\"WIN\",K$24:K146)-SUM(W$23:W145),\"\")","v":""},{"$f":"IF(AND(L146=\"LOSS\",L147<>\"LOSS\"),SUMIF(L$24:L146,\"LOSS\",K$24:K146)-SUM(X$23:X145),\"\")","v":-130.79024657032369}]
[null,"Row 147 (124)",null,47.008267255902346,null,12948.234410462033,null,129.48234410462032,null,null,155.37881292554439,"WIN",{"$f":"IF(COUNTA($F$6:$F$10)=5,(F148-F24)/F24,\"\")","v":0.31036132233875779},1,"last",null,null,null,null,null,null,null,{"$f":"IF(AND(L147=\"WIN\",L148<>\"WIN\"),SUMIF(L$24:L147,\"WIN\",K$24:K147)-SUM(W$23:W146),\"\")","v":155.37881292554448},{"$f":"IF(AND(L147=\"LOSS\",L148<>\"LOSS\"),SUMIF(L$24:L147,\"LOSS\",K$24:K147)-SUM(X$23:X146),\"\")","v":""}]
[null,"Row 148 (125)",null,64.772124274017571,null,13103.613223387578,null,131.03613223387578,null,null,-131.03613223387578,"LOSS",{"$f":"IF(COUNTA($F$6:$F$10)=5,(F149-F24)/F24,\"\")","v":0.29725770911537019},1,"last",null,null,null,null,null,null,null,{"$f":"IF(AND(L148=\"WIN\",L149<>\"WIN\"),SUMIF(L$24:L148,\"WIN\",K$24:K148)-SUM(W$23:W147),\"\")","v":""},{"$f":"IF(AND(L148=\"LOSS\",L149<>\"LOSS\"),SUMIF(L$24:L148,\"LOSS\",K$24:K148)-SUM(X$23:X147),\"\")","v":-131.03613223387583}]
[null,"Row 149 (126)",null,28.325130384432363,null,12972.577091153702,null,129.72577091153701,null,null,155.6709250938444,"WIN",{"$f":"IF(COUNTA($F$6:$F$10)=5,(F150-F24)/F24,\"\")","v":0.31282480162475457},1,"last",null,null,null,null,null,null,null,{"$f":"IF(AND(L149=\"WIN\",L150<>\"WIN\"),SUMIF(L$24:L149,\"WIN\",K$24:K149)-SUM(W$23:W148),\"\")","v":155.67092509384383},{"$f":"IF(AND(L149=\"LOSS\",L150<>\"LOSS\"),SUMIF(L$24:L149,\"LOSS\",K$24:K149)-SUM(X$23:X148),\"\")","v":""}]
[null,"Row 150 (127)",null,96.13906435349142,null,13128.248016247546,null,131.28248016247545,null,null,-131.28248016247545,"LOSS",{"$f":"IF(COUNTA($F$6:$F$10)=5,(F151-F24)/F24,\"\")","v":0.299696553608507},1,"new",null,null,null,null,null,null,null,{"$f":"IF(AND(L150=\"WIN\",L151<>\"WIN\"),SUMIF(L$24:L150,\"WIN\",K$24:K150)-SUM(W$23:W149),\"\")","v":""},{"$f":"IF(AND(L150=\"LOSS\",L151<>\"LOSS\"),SUMIF(L$24:L150,\"LOSS\",K$24:K150)-SUM(X$23:X149),\"\")","v":""}]
[null,"Row 151 (128)",null,77.252360569090115,null,12996.96553608507,null,129.96965536085071,null,null,-129.96965536085071,"LOSS",{"$f":"IF(COUNTA($F$6:$F$10)=5,(F152-F24)/F24,\"\")","v":0.28669958807242202},2,"last",null,null,null,null,null,null,null,{"$f":"IF(AND(L151=\"WIN\",L152<>\"WIN\"),SUMIF(L$24:L151,\"WIN\",K$24:K151)-SUM(W$23:W150),\"\")","v":""},{"$f":"IF(AND(L151=\"LOSS\",L152<>\"LOSS\"),SUMIF(L$24:L151,\"LOSS\",K$24:K151)-SUM(X$23:X150),\"\")","v":-261.25213552332661}]
[null,"Row 152 (129)",null,20.627560687289993,null,12866.99588072422,null,128.66995880724221,null,null,154.40395056869065,"WIN",{"$f":"IF(COUNTA($F$6:$F$10)=5,(F153-F24)/F24,\"\")","v":0.30213998312929108},1,"new",null,null,null,null,null,null,null,{"$f":"IF(AND(L152=\"WIN\",L153<>\"WIN\"),SUMIF(L$24:L152,\"WIN\",K$24:K152)-SUM(W$23:W151),\"\")","v":""},{"$f":"IF(AND(L152=\"LOSS\",L153<>\"LOSS\"),SUMIF(L$24:L152,\"LOSS\",K$24:K152)-SUM(X$23:X151),\"\")","v":""}]
[null,"Row 153 (130)",null,{"$f":"IF(COUNTA($F$6:$F$10)=5,100*RAND(),\"\")","v":10.482545907066598},null,13021.399831292911,null,{"$f":"IF(COUNTBLANK($F$6:$F$10),\"\",F153*$F$7)","v":130.21399831292911},null,null,156.25679797551493,{"$f":"IF(D153=\"\",\"\",IF(D153<$F$8,\"WIN\",\"LOSS\"))","v":"WIN"},{"$f":"IF(COUNTA($F$6:$F$10)=5,(F154-F24)/F24,\"\")","v":0.31776566292684255},{"$f":"IF(L153=L152,N152+1,1)","v":2},{"$f":"IF(N153=1,IF(N154=1,\"last\",\"new\"),IF(N154=1,\"last\",\"middle\"))","v":"last"},null,null,null,null,null,null,null,{"$f":"IF(AND(L153=\"WIN\",L154<>\"WIN\"),SUMIF(L$24:L153,\"WIN\",K$24:K153)-SUM(W$23:W152),\"\")","v":310.66074854420549},{"$f":"IF(AND(L153=\"LOSS\",L154<>\"LOSS\"),SUMIF(L$24:L153,\"LOSS\",K$24:K153)-SUM(X$23:X152),\"\")","v":""}]
[null,"Row 154 (131)",null,65.870594378523634,null,{"$f":"IF(COUNTBLANK($F$6:$F$10),\"\",IF(D153<$F$8,(1+$F$7*$F$9)*F153-$F$10,(1-$F$7)*F153-$F$10))","v":13177.656629268426},null,131.77656629268427,null,null,{"$f":"IF(COUNTBLANK($F$6:$F$10),\"\", IF(L154=\"win\", H154*$F$9-$F$10, IF(L154=\"loss\", -H154-$F$10)))","v":-131.77656629268427},"LOSS",{"$f":"IF(COUNTA($F$6:$F$10)=5,(F155-F24)/F24,\"\")","v":0.30458800629757404},1,"last",null,null,null,null,null,null,null,{"$f":"IF(AND(L154=\"WIN\",L155<>\"WIN\"),SUMIF(L$24:L154,\"WIN\",K$24:K154)-SUM(W$23:W153),\"\")","v":""},{"$f":"IF(AND(L154=\"LOSS\",L155<>\"LOSS\"),SUMIF(L$24:L154,\"LOSS\",K$24:K154)-SUM(X$23:X153),\"\")","v":-131.77656629268404}]
[null,"Row 155 (132)",null,14.102587533223399,null,13045.880062975741,null,130.45880062975741,null,null,156.55056075570889,"WIN",{"$f":"IF(COUNTA($F$6:$F$10)=5,(F156-F24)/F24,\"\")","v":0.32024306237314504},1,"new",null,null,null,null,null,null,null,{"$f":"IF(AND(L155=\"WIN\",L156<>\"WIN\"),SUMIF(L$24:L155,\"WIN\",K$24:K155)-SUM(W$23:W154),\"\")","v":""},{"$f":"IF(AND(L155=\"LOSS\",L156<>\"LOSS\"),SUMIF(L$24:L155,\"LOSS\",K$24:K155)-SUM(X$23:X154),\"\")","v":""}]
[null,"Row 156 (133)",null,39.807055657087723,null,13202.43062373145,null,132.02430623731451,null,null,158.42916748477739,"WIN",{"$f":"IF(COUNTA($F$6:$F$10)=5,(F157-F24)/F24,\"\")","v":0.33608597912162275},2,"middle",null,null,null,null,null,null,null,{"$f":"IF(AND(L156=\"WIN\",L157<>\"WIN\"),SUMIF(L$24:L156,\"WIN\",K$24:K156)-SUM(W$23:W155),\"\")","v":""},{"$f":"IF(AND(L156=\"LOSS\",L157<>\"LOSS\"),SUMIF(L$24:L156,\"LOSS\",K$24:K156)-SUM(X$23:X155),\"\")","v":""}]
[null,"Row 157 (134)",null,17.604170377605179,null,13360.859791216228,null,133.60859791216228,null,null,160.33031749459474,"WIN",{"$f":"IF(COUNTA($F$6:$F$10)=5,(F158-F24)/F24,\"\")","v":0.35211901087108216},3,"middle",null,null,null,null,null,null,null,{"$f":"IF(AND(L157=\"WIN\",L158<>\"WIN\"),SUMIF(L$24:L157,\"WIN\",K$24:K157)-SUM(W$23:W156),\"\")","v":""},{"$f":"IF(AND(L157=\"LOSS\",L158<>\"LOSS\"),SUMIF(L$24:L157,\"LOSS\",K$24:K157)-SUM(X$23:X156),\"\")","v":""}]
[null,"Row 158 (135)",null,54.809043864696548,null,13521.190108710822,null,135.21190108710823,null,null,162.25428130452988,"WIN",{"$f":"IF(COUNTA($F$6:$F$10)=5,(F159-F24)/F24,\"\")","v":0.36834443900153513},4,"last",null,null,null,null,null,null,null,{"$f":"IF(AND(L158=\"WIN\",L159<>\"WIN\"),SUMIF(L$24:L158,\"WIN\",K$24:K158)-SUM(W$23:W157),\"\")","v":637.56432703961036},{"$f":"IF(AND(L158=\"LOSS\",L159<>\"LOSS\"),SUMIF(L$24:L158,\"LOSS\",K$24:K158)-SUM(X$23:X157),\"\")","v":""}]
[null,"Row 159 (136)",null,90.828862530625514,null,13683.444390015351,null,136.8344439001535,null,null,-136.8344439001535,"LOSS",{"$f":"IF(COUNTA($F$6:$F$10)=5,(F160-F24)/F24,\"\")","v":0.35466099461151973},1,"new",null,null,null,null,null,null,null,{"$f":"IF(AND(L159=\"WIN\",L160<>\"WIN\"),SUMIF(L$24:L159,\"WIN\",K$24:K159)-SUM(W$23:W158),\"\")","v":""},{"$f":"IF(AND(L159=\"LOSS\",L160<>\"LOSS\"),SUMIF(L$24:L159,\"LOSS\",K$24:K159)-SUM(X$23:X158),\"\")","v":""}]
[null,"Row 160 (137)",null,77.182666014848778,null,13546.609946115197,null,135.46609946115197,null,null,-135.46609946115197,"LOSS",{"$f":"IF(COUNTA($F$6:$F$10)=5,(F161-F24)/F24,\"\")","v":0.34111438466540456},2,"last",null,null,null,null,null,null,null,{"$f":"IF(AND(L160=\"WIN\",L161<>\"WIN\"),SUMIF(L$24:L160,\"WIN\",K$24:K160)-SUM(W$23:W159),\"\")","v":""},{"$f":"IF(AND(L160=\"LOSS\",L161<>\"LOSS\"),SUMIF(L$24:L160,\"LOSS\",K$24:K160)-SUM(X$23:X159),\"\")","v":-272.30054336130615}]
[null,"Row 161 (138)",null,16.13248556686866,null,13411.143846654046,null,134.11143846654045,null,null,160.93372615984853,"WIN",{"$f":"IF(COUNTA($F$6:$F$10)=5,(F162-F24)/F24,\"\")","v":0.35720775728138943},1,"last",null,null,null,null,null,null,null,{"$f":"IF(AND(L161=\"WIN\",L162<>\"WIN\"),SUMIF(L$24:L161,\"WIN\",K$24:K161)-SUM(W$23:W160),\"\")","v":160.93372615984845},{"$f":"IF(AND(L161=\"LOSS\",L162<>\"LOSS\"),SUMIF(L$24:L161,\"LOSS\",K$24:K161)-SUM(X$23:X160),\"\")","v":""}]
[null,"Row 162 (139)",null,88.202497279605836,null,13572.077572813894,null,135.72077572813893,null,null,-135.72077572813893,"LOSS",{"$f":"IF(COUNTA($F$6:$F$10)=5,(F163-F24)/F24,\"\")","v":0.3436356797085755},1,"new",null,null,null,null,null,null,null,{"$f":"IF(AND(L162=\"WIN\",L163<>\"WIN\"),SUMIF(L$24:L162,\"WIN\",K$24:K162)-SUM(W$23:W161),\"\")","v":""},{"$f":"IF(AND(L162=\"LOSS\",L163<>\"LOSS\"),SUMIF(L$24:L162,\"LOSS\",K$24:K162)-SUM(X$23:X161),\"\")","v":""}]
[null,"Row 163 (140)",null,92.488832427114389,null,13436.356797085755,null,134.36356797085756,null,null,-134.36356797085756,"LOSS",{"$f":"IF(COUNTA($F$6:$F$10)=5,(F164-F24)/F24,\"\")","v":0.33019932291148979},2,"last",null,null,null,null,null,null,null,{"$f":"IF(AND(L163=\"WIN\",L164<>\"WIN\"),SUMIF(L$24:L163,\"WIN\",K$24:K163)-SUM(W$23:W162),\"\")","v":""},{"$f":"IF(AND(L163=\"LOSS\",L164<>\"LOSS\"),SUMIF(L$24:L163,\"LOSS\",K$24:K163)-SUM(X$23:X162),\"\")","v":-270.08434369899624}]
[null,"Row 164 (141)",null,27.435798397245847,null,13301.993229114898,null,133.01993229114899,null,null,159.62391874937879,"WIN",{"$f":"IF(COUNTA($F$6:$F$10)=5,(F165-F24)/F24,\"\")","v":0.34616171478642771},1,"new",null,null,null,null,null,null,null,{"$f":"IF(AND(L164=\"WIN\",L165<>\"WIN\"),SUMIF(L$24:L164,\"WIN\",K$24:K164)-SUM(W$23:W163),\"\")","v":""},{"$f":"IF(AND(L164=\"LOSS\",L165<>\"LOSS\"),SUMIF(L$24:L164,\"LOSS\",K$24:K164)-SUM(X$23:X163),\"\")","v":""}]
[null,"Row 165 (142)",null,45.036585240259122,null,13461.617147864277,null,134.61617147864277,null,null,161.53940577437132,"WIN",{"$f":"IF(COUNTA($F$6:$F$10)=5,(F166-F24)/F24,\"\")","v":0.36231565536386479},2,"last",null,null,null,null,null,null,null,{"$f":"IF(AND(L165=\"WIN\",L166<>\"WIN\"),SUMIF(L$24:L165,\"WIN\",K$24:K165)-SUM(W$23:W164),\"\")","v":321.16332452374991},{"$f":"IF(AND(L165=\"LOSS\",L166<>\"LOSS\"),SUMIF(L$24:L165,\"LOSS\",K$24:K165)-SUM(X$23:X164),\"\")","v":""}]
[null,"Row 166 (143)",null,72.843891424461702,null,13623.156553638648,null,136.23156553638648,null,null,-136.23156553638648,"LOSS",{"$f":"IF(COUNTA($F$6:$F$10)=5,(F167-F24)/F24,\"\")","v":0.34869249881022607},1,"last",null,null,null,null,null,null,null,{"$f":"IF(AND(L166=\"WIN\",L167<>\"WIN\"),SUMIF(L$24:L166,\"WIN\",K$24:K166)-SUM(W$23:W165),\"\")","v":""},{"$f":"IF(AND(L166=\"LOSS\",L167<>\"LOSS\"),SUMIF(L$24:L166,\"LOSS\",K$24:K166)-SUM(X$23:X165),\"\")","v":-136.23156553638637}]
[null,"Row 167 (144)",null,25.35934657000638,null,13486.924988102261,null,134.8692498810226,null,null,161.84309985722712,"WIN",{"$f":"IF(COUNTA($F$6:$F$10)=5,(F168-F24)/F24,\"\")","v":0.3648768087959488},1,"new",null,null,null,null,null,null,null,{"$f":"IF(AND(L167=\"WIN\",L168<>\"WIN\"),SUMIF(L$24:L167,\"WIN\",K$24:K167)-SUM(W$23:W166),\"\")","v":""},{"$f":"IF(AND(L167=\"LOSS\",L168<>\"LOSS\"),SUMIF(L$24:L167,\"LOSS\",K$24:K167)-SUM(X$23:X166),\"\")","v":""}]
[null,"Row 168 (145)",null,45.96910258710313,null,13648.768087959488,null,136.48768087959488,null,null,163.78521705551384,"WIN",{"$f":"IF(COUNTA($F$6:$F$10)=5,(F169-F24)/F24,\"\")","v":0.38125533050150023},2,"last",null,null,null,null,null,null,null,{"$f":"IF(AND(L168=\"WIN\",L169<>\"WIN\"),SUMIF(L$24:L168,\"WIN\",K$24:K168)-SUM(W$23:W167),\"\")","v":325.62831691274187},{"$f":"IF(AND(L168=\"LOSS\",L169<>\"LOSS\"),SUMIF(L$24:L168,\"LOSS\",K$24:K168)-SUM(X$23:X167),\"\")","v":""}]
[null,"Row 169 (146)",null,75.41423722609963,null,13812.553305015002,null,138.12553305015004,null,null,-138.12553305015004,"LOSS",{"$f":"IF(COUNTA($F$6:$F$10)=5,(F170-F24)/F24,\"\")","v":0.36744277719648527},1,"new",null,null,null,null,null,null,null,{"$f":"IF(AND(L169=\"WIN\",L170<>\"WIN\"),SUMIF(L$24:L169,\"WIN\",K$24:K169)-SUM(W$23:W168),\"\")","v":""},{"$f":"IF(AND(L169=\"LOSS\",L170<>\"LOSS\"),SUMIF(L$24:L169,\"LOSS\",K$24:K169)-SUM(X$23:X168),\"\")","v":""}]
[null,"Row 170 (147)",null,57.202217659821343,null,13674.427771964853,null,136.74427771964852,null,null,-136.74427771964852,"LOSS",{"$f":"IF(COUNTA($F$6:$F$10)=5,(F171-F24)/F24,\"\")","v":0.3537683494245204},2,"middle",null,null,null,null,null,null,null,{"$f":"IF(AND(L170=\"WIN\",L171<>\"WIN\"),SUMIF(L$24:L170,\"WIN\",K$24:K170)-SUM(W$23:W169),\"\")","v":""},{"$f":"IF(AND(L170=\"LOSS\",L171<>\"LOSS\"),SUMIF(L$24:L170,\"LOSS\",K$24:K170)-SUM(X$23:X169),\"\")","v":""}]
[null,"Row 171 (148)",null,80.884623210365746,null,13537.683494245204,null,135.37683494245204,null,null,-135.37683494245204,"LOSS",{"$f":"IF(COUNTA($F$6:$F$10)=5,(F172-F24)/F24,\"\")","v":0.34023066593027523},3,"last",null,null,null,null,null,null,null,{"$f":"IF(AND(L171=\"WIN\",L172<>\"WIN\"),SUMIF(L$24:L171,\"WIN\",K$24:K171)-SUM(W$23:W170),\"\")","v":""},{"$f":"IF(AND(L171=\"LOSS\",L172<>\"LOSS\"),SUMIF(L$24:L171,\"LOSS\",K$24:K171)-SUM(X$23:X170),\"\")","v":-410.24664571225094}]
[null,"Row 172 (149)",null,33.767947197435888,null,13402.306659302752,null,134.02306659302752,null,null,160.82767991163303,"WIN",{"$f":"IF(COUNTA($F$6:$F$10)=5,(F173-F24)/F24,\"\")","v":0.3563134339214386},1,"new",null,null,null,null,null,null,null,{"$f":"IF(AND(L172=\"WIN\",L173<>\"WIN\"),SUMIF(L$24:L172,\"WIN\",K$24:K172)-SUM(W$23:W171),\"\")","v":""},{"$f":"IF(AND(L172=\"LOSS\",L173<>\"LOSS\"),SUMIF(L$24:L172,\"LOSS\",K$24:K172)-SUM(X$23:X171),\"\")","v":""}]
[null,"Row 173 (150)",null,35.699762474853067,null,13563.134339214386,null,135.63134339214386,null,null,162.75761207057263,"WIN",{"$f":"IF(COUNTA($F$6:$F$10)=5,(F174-F24)/F24,\"\")","v":0.37258919512849586},2,"middle",null,null,null,null,null,null,null,{"$f":"IF(AND(L173=\"WIN\",L174<>\"WIN\"),SUMIF(L$24:L173,\"WIN\",K$24:K173)-SUM(W$23:W172),\"\")","v":""},{"$f":"IF(AND(L173=\"LOSS\",L174<>\"LOSS\"),SUMIF(L$24:L173,\"LOSS\",K$24:K173)-SUM(X$23:X172),\"\")","v":""}]
[null,"Row 174 (151)",null,10.855677418846366,null,13725.891951284959,null,137.25891951284959,null,null,164.71070341541949,"WIN",{"$f":"IF(COUNTA($F$6:$F$10)=5,(F175-F24)/F24,\"\")","v":0.38906026547003786},3,"middle",null,null,null,null,null,null,null,{"$f":"IF(AND(L174=\"WIN\",L175<>\"WIN\"),SUMIF(L$24:L174,\"WIN\",K$24:K174)-SUM(W$23:W173),\"\")","v":""},{"$f":"IF(AND(L174=\"LOSS\",L175<>\"LOSS\"),SUMIF(L$24:L174,\"LOSS\",K$24:K174)-SUM(X$23:X173),\"\")","v":""}]
[null,"Row 175 (152)",null,9.1163552240453249,null,13890.602654700378,null,138.90602654700379,null,null,166.68723185640454,"WIN",{"$f":"IF(COUNTA($F$6:$F$10)=5,(F176-F24)/F24,\"\")","v":0.40572898865567841},4,"last",null,null,null,null,null,null,null,{"$f":"IF(AND(L175=\"WIN\",L176<>\"WIN\"),SUMIF(L$24:L175,\"WIN\",K$24:K175)-SUM(W$23:W174),\"\")","v":654.98322725402977},{"$f":"IF(AND(L175=\"LOSS\",L176<>\"LOSS\"),SUMIF(L$24:L175,\"LOSS\",K$24:K175)-SUM(X$23:X174),\"\")","v":""}]
[null,"Row 176 (153)",null,70.171321215530696,null,14057.289886556784,null,140.57289886556785,null,null,-140.57289886556785,"LOSS",{"$f":"IF(COUNTA($F$6:$F$10)=5,(F177-F24)/F24,\"\")","v":0.39167169876912156},1,"new",null,null,null,null,null,null,null,{"$f":"IF(AND(L176=\"WIN\",L177<>\"WIN\"),SUMIF(L$24:L176,\"WIN\",K$24:K176)-SUM(W$23:W175),\"\")","v":""},{"$f":"IF(AND(L176=\"LOSS\",L177<>\"LOSS\"),SUMIF(L$24:L176,\"LOSS\",K$24:K176)-SUM(X$23:X175),\"\")","v":""}]
[null,"Row 177 (154)",null,95.716832864539811,null,13916.716987691216,null,139.16716987691217,null,null,-139.16716987691217,"LOSS",{"$f":"IF(COUNTA($F$6:$F$10)=5,(F178-F24)/F24,\"\")","v":0.37775498178143041},2,"middle",null,null,null,null,null,null,null,{"$f":"IF(AND(L177=\"WIN\",L178<>\"WIN\"),SUMIF(L$24:L177,\"WIN\",K$24:K177)-SUM(W$23:W176),\"\")","v":""},{"$f":"IF(AND(L177=\"LOSS\",L178<>\"LOSS\"),SUMIF(L$24:L177,\"LOSS\",K$24:K177)-SUM(X$23:X176),\"\")","v":""}]
[null,"Row 178 (155)",null,68.582598017506641,null,13777.549817814304,null,137.77549817814304,null,null,-137.77549817814304,"LOSS",{"$f":"IF(COUNTA($F$6:$F$10)=5,(F179-F24)/F24,\"\")","v":0.36397743196361609},3,"middle",null,null,null,null,null,null,null,{"$f":"IF(AND(L178=\"WIN\",L179<>\"WIN\"),SUMIF(L$24:L178,\"WIN\",K$24:K178)-SUM(W$23:W177),\"\")","v":""},{"$f":"IF(AND(L178=\"LOSS\",L179<>\"LOSS\"),SUMIF(L$24:L178,\"LOSS\",K$24:K178)-SUM(X$23:X177),\"\")","v":""}]
[null,"Row 179 (156)",null,81.745745910177362,null,13639.774319636161,null,136.3977431963616,null,null,-136.3977431963616,"LOSS",{"$f":"IF(COUNTA($F$6:$F$10)=5,(F180-F24)/F24,\"\")","v":0.35033765764397995},4,"middle",null,null,null,null,null,null,null,{"$f":"IF(AND(L179=\"WIN\",L180<>\"WIN\"),SUMIF(L$24:L179,\"WIN\",K$24:K179)-SUM(W$23:W178),\"\")","v":""},{"$f":"IF(AND(L179=\"LOSS\",L180<>\"LOSS\"),SUMIF(L$24:L179,\"LOSS\",K$24:K179)-SUM(X$23:X178),\"\")","v":""}]
[null,"Row 180 (157)",null,60.044778113372352,null,13503.376576439799,null,135.033765764398,null,null,-135.033765764398,"LOSS",{"$f":"IF(COUNTA($F$6:$F$10)=5,(F181-F24)/F24,\"\")","v":0.33683428106754015},5,"last",null,null,null,null,null,null,null,{"$f":"IF(AND(L180=\"WIN\",L181<>\"WIN\"),SUMIF(L$24:L180,\"WIN\",K$24:K180)-SUM(W$23:W179),\"\")","v":""},{"$f":"IF(AND(L180=\"LOSS\",L181<>\"LOSS\"),SUMIF(L$24:L180,\"LOSS\",K$24:K180)-SUM(X$23:X179),\"\")","v":-688.94707588138226}]
[null,"Row 181 (158)",null,15.673509106567195,null,13368.342810675402,null,133.68342810675401,null,null,160.42011372810481,"WIN",{"$f":"IF(COUNTA($F$6:$F$10)=5,(F182-F24)/F24,\"\")","v":0.35287629244035068},1,"new",null,null,null,null,null,null,null,{"$f":"IF(AND(L181=\"WIN\",L182<>\"WIN\"),SUMIF(L$24:L181,\"WIN\",K$24:K181)-SUM(W$23:W180),\"\")","v":""},{"$f":"IF(AND(L181=\"LOSS\",L182<>\"LOSS\"),SUMIF(L$24:L181,\"LOSS\",K$24:K181)-SUM(X$23:X180),\"\")","v":""}]
[null,"Row 182 (159)",null,12.452699208799523,null,13528.762924403507,null,135.28762924403506,null,null,162.34515509284208,"WIN",{"$f":"IF(COUNTA($F$6:$F$10)=5,(F183-F24)/F24,\"\")","v":0.36911080794963491},2,"middle",null,null,null,null,null,null,null,{"$f":"IF(AND(L182=\"WIN\",L183<>\"WIN\"),SUMIF(L$24:L182,\"WIN\",K$24:K182)-SUM(W$23:W181),\"\")","v":""},{"$f":"IF(AND(L182=\"LOSS\",L183<>\"LOSS\"),SUMIF(L$24:L182,\"LOSS\",K$24:K182)-SUM(X$23:X181),\"\")","v":""}]
[null,"Row 183 (160)",null,30.682216356633941,null,13691.108079496349,null,136.91108079496348,null,null,164.29329695395617,"WIN",{"$f":"IF(COUNTA($F$6:$F$10)=5,(F184-F24)/F24,\"\")","v":0.38554013764503053},3,"middle",null,null,null,null,null,null,null,{"$f":"IF(AND(L183=\"WIN\",L184<>\"WIN\"),SUMIF(L$24:L183,\"WIN\",K$24:K183)-SUM(W$23:W182),\"\")","v":""},{"$f":"IF(AND(L183=\"LOSS\",L184<>\"LOSS\"),SUMIF(L$24:L183,\"LOSS\",K$24:K183)-SUM(X$23:X182),\"\")","v":""}]
[null,"Row 184 (161)",null,10.611130705520743,null,13855.401376450305,null,138.55401376450305,null,null,166.26481651740366,"WIN",{"$f":"IF(COUNTA($F$6:$F$10)=5,(F185-F24)/F24,\"\")","v":0.40216661929677083},4,"middle",null,null,null,null,null,null,null,{"$f":"IF(AND(L184=\"WIN\",L185<>\"WIN\"),SUMIF(L$24:L184,\"WIN\",K$24:K184)-SUM(W$23:W183),\"\")","v":""},{"$f":"IF(AND(L184=\"LOSS\",L185<>\"LOSS\"),SUMIF(L$24:L184,\"LOSS\",K$24:K184)-SUM(X$23:X183),\"\")","v":""}]
[null,"Row 185 (162)",null,6.0266514161934399,null,14021.666192967708,null,140.21666192967709,null,null,168.25999431561249,"WIN",{"$f":"IF(COUNTA($F$6:$F$10)=5,(F186-F24)/F24,\"\")","v":0.4189926187283321},5,"middle",null,null,null,null,null,null,null,{"$f":"IF(AND(L185=\"WIN\",L186<>\"WIN\"),SUMIF(L$24:L185,\"WIN\",K$24:K185)-SUM(W$23:W184),\"\")","v":""},{"$f":"IF(AND(L185=\"LOSS\",L186<>\"LOSS\"),SUMIF(L$24:L185,\"LOSS\",K$24:K185)-SUM(X$23:X184),\"\")","v":""}]
[null,"Row 186 (163)",null,48.422574259116239,null,14189.926187283321,null,141.89926187283322,null,null,170.27911424739986,"WIN",{"$f":"IF(COUNTA($F$6:$F$10)=5,(F187-F24)/F24,\"\")","v":0.43602053015307213},6,"last",null,null,null,null,null,null,null,{"$f":"IF(AND(L186=\"WIN\",L187<>\"WIN\"),SUMIF(L$24:L186,\"WIN\",K$24:K186)-SUM(W$23:W185),\"\")","v":991.86249085531927},{"$f":"IF(AND(L186=\"LOSS\",L187<>\"LOSS\"),SUMIF(L$24:L186,\"LOSS\",K$24:K186)-SUM(X$23:X185),\"\")","v":""}]
[null,"Row 187 (164)",null,95.038538763410727,null,14360.205301530721,null,143.60205301530721,null,null,-143.60205301530721,"LOSS",{"$f":"IF(COUNTA($F$6:$F$10)=5,(F188-F24)/F24,\"\")","v":0.42166032485154137},1,"last",null,null,null,null,null,null,null,{"$f":"IF(AND(L187=\"WIN\",L188<>\"WIN\"),SUMIF(L$24:L187,\"WIN\",K$24:K187)-SUM(W$23:W186),\"\")","v":""},{"$f":"IF(AND(L187=\"LOSS\",L188<>\"LOSS\"),SUMIF(L$24:L187,\"LOSS\",K$24:K187)-SUM(X$23:X186),\"\")","v":-143.60205301530732}]
[null,"Row 188 (165)",null,54.138156165751361,null,14216.603248515414,null,142.16603248515415,null,null,170.59923898218497,"WIN",{"$f":"IF(COUNTA($F$6:$F$10)=5,(F189-F24)/F24,\"\")","v":0.43872024874975996},1,"new",null,null,null,null,null,null,null,{"$f":"IF(AND(L188=\"WIN\",L189<>\"WIN\"),SUMIF(L$24:L188,\"WIN\",K$24:K188)-SUM(W$23:W187),\"\")","v":""},{"$f":"IF(AND(L188=\"LOSS\",L189<>\"LOSS\"),SUMIF(L$24:L188,\"LOSS\",K$24:K188)-SUM(X$23:X187),\"\")","v":""}]
[null,"Row 189 (166)",null,48.516347363257729,null,14387.2024874976,null,143.87202487497601,null,null,172.64642984997121,"WIN",{"$f":"IF(COUNTA($F$6:$F$10)=5,(F190-F24)/F24,\"\")","v":0.45598489173475698},2,"middle",null,null,null,null,null,null,null,{"$f":"IF(AND(L189=\"WIN\",L190<>\"WIN\"),SUMIF(L$24:L189,\"WIN\",K$24:K189)-SUM(W$23:W188),\"\")","v":""},{"$f":"IF(AND(L189=\"LOSS\",L190<>\"LOSS\"),SUMIF(L$24:L189,\"LOSS\",K$24:K189)-SUM(X$23:X188),\"\")","v":""}]
[null,"Row 190 (167)",null,39.732764269654908,null,14559.84891734757,null,145.59848917347571,null,null,174.71818700817084,"WIN",{"$f":"IF(COUNTA($F$6:$F$10)=5,(F191-F24)/F24,\"\")","v":0.47345671043557414},3,"last",null,null,null,null,null,null,null,{"$f":"IF(AND(L190=\"WIN\",L191<>\"WIN\"),SUMIF(L$24:L190,\"WIN\",K$24:K190)-SUM(W$23:W189),\"\")","v":517.9638558403276},{"$f":"IF(AND(L190=\"LOSS\",L191<>\"LOSS\"),SUMIF(L$24:L190,\"LOSS\",K$24:K190)-SUM(X$23:X189),\"\")","v":""}]
[null,"Row 191 (168)",null,87.035068168109262,null,14734.567104355741,null,147.34567104355742,null,null,-147.34567104355742,"LOSS",{"$f":"IF(COUNTA($F$6:$F$10)=5,(F192-F24)/F24,\"\")","v":0.45872214333121847},1,"new",null,null,null,null,null,null,null,{"$f":"IF(AND(L191=\"WIN\",L192<>\"WIN\"),SUMIF(L$24:L191,\"WIN\",K$24:K191)-SUM(W$23:W190),\"\")","v":""},{"$f":"IF(AND(L191=\"LOSS\",L192<>\"LOSS\"),SUMIF(L$24:L191,\"LOSS\",K$24:K191)-SUM(X$23:X190),\"\")","v":""}]
[null,"Row 192 (169)",null,99.673647295665845,null,14587.221433312185,null,145.87221433312186,null,null,-145.87221433312186,"LOSS",{"$f":"IF(COUNTA($F$6:$F$10)=5,(F193-F24)/F24,\"\")","v":0.44413492189790632},2,"last",null,null,null,null,null,null,null,{"$f":"IF(AND(L192=\"WIN\",L193<>\"WIN\"),SUMIF(L$24:L192,\"WIN\",K$24:K192)-SUM(W$23:W191),\"\")","v":""},{"$f":"IF(AND(L192=\"LOSS\",L193<>\"LOSS\"),SUMIF(L$24:L192,\"LOSS\",K$24:K192)-SUM(X$23:X191),\"\")","v":-293.21788537667817}]
[null,"Row 193 (170)",null,29.789273577225273,null,14441.349218979063,null,144.41349218979065,null,null,173.29619062774876,"WIN",{"$f":"IF(COUNTA($F$6:$F$10)=5,(F194-F24)/F24,\"\")","v":0.46146454096068118},1,"new",null,null,null,null,null,null,null,{"$f":"IF(AND(L193=\"WIN\",L194<>\"WIN\"),SUMIF(L$24:L193,\"WIN\",K$24:K193)-SUM(W$23:W192),\"\")","v":""},{"$f":"IF(AND(L193=\"LOSS\",L194<>\"LOSS\"),SUMIF(L$24:L193,\"LOSS\",K$24:K193)-SUM(X$23:X192),\"\")","v":""}]
[null,"Row 194 (171)",null,28.514801771934572,null,14614.645409606812,null,146.14645409606811,null,null,175.37574491528173,"WIN",{"$f":"IF(COUNTA($F$6:$F$10)=5,(F195-F24)/F24,\"\")","v":0.47900211545220939},2,"middle",null,null,null,null,null,null,null,{"$f":"IF(AND(L194=\"WIN\",L195<>\"WIN\"),SUMIF(L$24:L194,\"WIN\",K$24:K194)-SUM(W$23:W193),\"\")","v":""},{"$f":"IF(AND(L194=\"LOSS\",L195<>\"LOSS\"),SUMIF(L$24:L194,\"LOSS\",K$24:K194)-SUM(X$23:X193),\"\")","v":""}]
[null,"Row 195 (172)",null,15.38227299811582,null,14790.021154522094,null,147.90021154522094,null,null,177.48025385426513,"WIN",{"$f":"IF(COUNTA($F$6:$F$10)=5,(F196-F24)/F24,\"\")","v":0.4967501408376358},3,"last",null,null,null,null,null,null,null,{"$f":"IF(AND(L195=\"WIN\",L196<>\"WIN\"),SUMIF(L$24:L195,\"WIN\",K$24:K195)-SUM(W$23:W194),\"\")","v":526.15218939729493},{"$f":"IF(AND(L195=\"LOSS\",L196<>\"LOSS\"),SUMIF(L$24:L195,\"LOSS\",K$24:K195)-SUM(X$23:X194),\"\")","v":""}]
[null,"Row 196 (173)",null,95.500393416105396,null,14967.501408376358,null,149.67501408376359,null,null,-149.67501408376359,"LOSS",{"$f":"IF(COUNTA($F$6:$F$10)=5,(F197-F24)/F24,\"\")","v":0.48178263942925953},1,"new",null,null,null,null,null,null,null,{"$f":"IF(AND(L196=\"WIN\",L197<>\"WIN\"),SUMIF(L$24:L196,\"WIN\",K$24:K196)-SUM(W$23:W195),\"\")","v":""},{"$f":"IF(AND(L196=\"LOSS\",L197<>\"LOSS\"),SUMIF(L$24:L196,\"LOSS\",K$24:K196)-SUM(X$23:X195),\"\")","v":""}]
[null,"Row 197 (174)",null,91.434666942697362,null,14817.826394292595,null,148.17826394292595,null,null,-148.17826394292595,"LOSS",{"$f":"IF(COUNTA($F$6:$F$10)=5,(F198-F24)/F24,\"\")","v":0.46696481303496695},2,"middle",null,null,null,null,null,null,null,{"$f":"IF(AND(L197=\"WIN\",L198<>\"WIN\"),SUMIF(L$24:L197,\"WIN\",K$24:K197)-SUM(W$23:W196),\"\")","v":""},{"$f":"IF(AND(L197=\"LOSS\",L198<>\"LOSS\"),SUMIF(L$24:L197,\"LOSS\",K$24:K197)-SUM(X$23:X196),\"\")","v":""}]
[null,"Row 198 (175)",null,86.248261979657158,null,14669.648130349669,null,146.69648130349671,null,null,-146.69648130349671,"LOSS",{"$f":"IF(COUNTA($F$6:$F$10)=5,(F199-F24)/F24,\"\")","v":0.45229516490461719},3,"middle",null,null,null,null,null,null,null,{"$f":"IF(AND(L198=\"WIN\",L199<>\"WIN\"),SUMIF(L$24:L198,\"WIN\",K$24:K198)-SUM(W$23:W197),\"\")","v":""},{"$f":"IF(AND(L198=\"LOSS\",L199<>\"LOSS\"),SUMIF(L$24:L198,\"LOSS\",K$24:K198)-SUM(X$23:X197),\"\")","v":""}]
[null,"Row 199 (176)",null,80.19712162430838,null,14522.951649046172,null,145.22951649046172,null,null,-145.22951649046172,"LOSS",{"$f":"IF(COUNTA($F$6:$F$10)=5,(F200-F24)/F24,\"\")","v":0.43777221325557092},4,"last",null,null,null,null,null,null,null,{"$f":"IF(AND(L199=\"WIN\",L200<>\"WIN\"),SUMIF(L$24:L199,\"WIN\",K$24:K199)-SUM(W$23:W198),\"\")","v":""},{"$f":"IF(AND(L199=\"LOSS\",L200<>\"LOSS\"),SUMIF(L$24:L199,\"LOSS\",K$24:K199)-SUM(X$23:X198),\"\")","v":-589.77927582064694}]
[null,"Row 200 (177)",null,14.095484292787308,null,14377.722132555709,null,143.77722132555709,null,null,172.5326655906685,"WIN",{"$f":"IF(COUNTA($F$6:$F$10)=5,(F201-F24)/F24,\"\")","v":0.45502547981463776},1,"last",null,null,null,null,null,null,null,{"$f":"IF(AND(L200=\"WIN\",L201<>\"WIN\"),SUMIF(L$24:L200,\"WIN\",K$24:K200)-SUM(W$23:W199),\"\")","v":172.53266559066833},{"$f":"IF(AND(L200=\"LOSS\",L201<>\"LOSS\"),SUMIF(L$24:L200,\"LOSS\",K$24:K200)-SUM(X$23:X199),\"\")","v":""}]
[null,"Row 201 (178)",null,96.765956112204037,null,14550.254798146378,null,145.50254798146378,null,null,-145.50254798146378,"LOSS",{"$f":"IF(COUNTA($F$6:$F$10)=5,(F202-F24)/F24,\"\")","v":0.44047522501649145},1,"new",null,null,null,null,null,null,null,{"$f":"IF(AND(L201=\"WIN\",L202<>\"WIN\"),SUMIF(L$24:L201,\"WIN\",K$24:K201)-SUM(W$23:W200),\"\")","v":""},{"$f":"IF(AND(L201=\"LOSS\",L202<>\"LOSS\"),SUMIF(L$24:L201,\"LOSS\",K$24:K201)-SUM(X$23:X200),\"\")","v":""}]
[null,"Row 202 (179)",null,75.200910625458008,null,14404.752250164915,null,144.04752250164915,null,null,-144.04752250164915,"LOSS",{"$f":"IF(COUNTA($F$6:$F$10)=5,(F203-F24)/F24,\"\")","v":0.42607047276632659},2,"last",null,null,null,null,null,null,null,{"$f":"IF(AND(L202=\"WIN\",L203<>\"WIN\"),SUMIF(L$24:L202,\"WIN\",K$24:K202)-SUM(W$23:W201),\"\")","v":""},{"$f":"IF(AND(L202=\"LOSS\",L203<>\"LOSS\"),SUMIF(L$24:L202,\"LOSS\",K$24:K202)-SUM(X$23:X201),\"\")","v":-289.55007048311199}]
[null,"Row 203 (180)",null,30.642012841992393,null,14260.704727663266,null,142.60704727663267,null,null,171.1284567319592,"WIN",{"$f":"IF(COUNTA($F$6:$F$10)=5,(F204-F24)/F24,\"\")","v":0.44318331843952258},1,"last",null,null,null,null,null,null,null,{"$f":"IF(AND(L203=\"WIN\",L204<>\"WIN\"),SUMIF(L$24:L203,\"WIN\",K$24:K203)-SUM(W$23:W202),\"\")","v":171.12845673195989},{"$f":"IF(AND(L203=\"LOSS\",L204<>\"LOSS\"),SUMIF(L$24:L203,\"LOSS\",K$24:K203)-SUM(X$23:X202),\"\")","v":""}]
[null,"Row 204 (181)",null,70.963644011388595,null,14431.833184395226,null,144.31833184395225,null,null,-144.31833184395225,"LOSS",{"$f":"IF(COUNTA($F$6:$F$10)=5,(F205-F24)/F24,\"\")","v":0.42875148525512724},1,"new",null,null,null,null,null,null,null,{"$f":"IF(AND(L204=\"WIN\",L205<>\"WIN\"),SUMIF(L$24:L204,\"WIN\",K$24:K204)-SUM(W$23:W203),\"\")","v":""},{"$f":"IF(AND(L204=\"LOSS\",L205<>\"LOSS\"),SUMIF(L$24:L204,\"LOSS\",K$24:K204)-SUM(X$23:X203),\"\")","v":""}]
[null,"Row 205 (182)",null,95.262472573067512,null,14287.514852551272,null,142.87514852551271,null,null,-142.87514852551271,"LOSS",{"$f":"IF(COUNTA($F$6:$F$10)=5,(F206-F24)/F24,\"\")","v":0.41446397040257599},2,"last",null,null,null,null,null,null,null,{"$f":"IF(AND(L205=\"WIN\",L206<>\"WIN\"),SUMIF(L$24:L205,\"WIN\",K$24:K205)-SUM(W$23:W204),\"\")","v":""},{"$f":"IF(AND(L205=\"LOSS\",L206<>\"LOSS\"),SUMIF(L$24:L205,\"LOSS\",K$24:K205)-SUM(X$23:X204),\"\")","v":-287.19348036946394}]
[null,"Row 206 (183)",null,7.5242663352778845,null,14144.63970402576,null,141.44639704025761,null,null,169.73567644830914,"WIN",{"$f":"IF(COUNTA($F$6:$F$10)=5,(F207-F24)/F24,\"\")","v":0.43143753804740681},1,"new",null,null,null,null,null,null,null,{"$f":"IF(AND(L206=\"WIN\",L207<>\"WIN\"),SUMIF(L$24:L206,\"WIN\",K$24:K206)-SUM(W$23:W205),\"\")","v":""},{"$f":"IF(AND(L206=\"LOSS\",L207<>\"LOSS\"),SUMIF(L$24:L206,\"LOSS\",K$24:K206)-SUM(X$23:X205),\"\")","v":""}]
[null,"Row 207 (184)",null,18.753973502162623,null,14314.375380474068,null,143.1437538047407,null,null,171.77250456568882,"WIN",{"$f":"IF(COUNTA($F$6:$F$10)=5,(F208-F24)/F24,\"\")","v":0.44861478850397579},2,"middle",null,null,null,null,null,null,null,{"$f":"IF(AND(L207=\"WIN\",L208<>\"WIN\"),SUMIF(L$24:L207,\"WIN\",K$24:K207)-SUM(W$23:W206),\"\")","v":""},{"$f":"IF(AND(L207=\"LOSS\",L208<>\"LOSS\"),SUMIF(L$24:L207,\"LOSS\",K$24:K207)-SUM(X$23:X206),\"\")","v":""}]
[null,"Row 208 (185)",null,32.757019230609366,null,14486.147885039758,null,144.86147885039759,null,null,173.8337746204771,"WIN",{"$f":"IF(COUNTA($F$6:$F$10)=5,(F209-F24)/F24,\"\")","v":0.46599816596602361},3,"middle",null,null,null,null,null,null,null,{"$f":"IF(AND(L208=\"WIN\",L209<>\"WIN\"),SUMIF(L$24:L208,\"WIN\",K$24:K208)-SUM(W$23:W207),\"\")","v":""},{"$f":"IF(AND(L208=\"LOSS\",L209<>\"LOSS\"),SUMIF(L$24:L208,\"LOSS\",K$24:K208)-SUM(X$23:X207),\"\")","v":""}]
[null,"Row 209 (186)",null,46.540520912733626,null,14659.981659660236,null,146.59981659660235,null,null,175.91977991592282,"WIN",{"$f":"IF(COUNTA($F$6:$F$10)=5,(F210-F24)/F24,\"\")","v":0.48359014395761585},4,"middle",null,null,null,null,null,null,null,{"$f":"IF(AND(L209=\"WIN\",L210<>\"WIN\"),SUMIF(L$24:L209,\"WIN\",K$24:K209)-SUM(W$23:W208),\"\")","v":""},{"$f":"IF(AND(L209=\"LOSS\",L210<>\"LOSS\"),SUMIF(L$24:L209,\"LOSS\",K$24:K209)-SUM(X$23:X208),\"\")","v":""}]
[null,"Row 210 (187)",null,48.441778751343335,null,14835.901439576159,null,148.35901439576159,null,null,178.03081727491391,"WIN",{"$f":"IF(COUNTA($F$6:$F$10)=5,(F211-F24)/F24,\"\")","v":0.50139322568510725},5,"last",null,null,null,null,null,null,null,{"$f":"IF(AND(L210=\"WIN\",L211<>\"WIN\"),SUMIF(L$24:L210,\"WIN\",K$24:K210)-SUM(W$23:W209),\"\")","v":869.29255282531085},{"$f":"IF(AND(L210=\"LOSS\",L211<>\"LOSS\"),SUMIF(L$24:L210,\"LOSS\",K$24:K210)-SUM(X$23:X209),\"\")","v":""}]
[null,"Row 211 (188)",null,64.463993602893694,null,15013.932256851072,null,150.13932256851072,null,null,-150.13932256851072,"LOSS",{"$f":"IF(COUNTA($F$6:$F$10)=5,(F212-F24)/F24,\"\")","v":0.48637929342825609},1,"new",null,null,null,null,null,null,null,{"$f":"IF(AND(L211=\"WIN\",L212<>\"WIN\"),SUMIF(L$24:L211,\"WIN\",K$24:K211)-SUM(W$23:W210),\"\")","v":""},{"$f":"IF(AND(L211=\"LOSS\",L212<>\"LOSS\"),SUMIF(L$24:L211,\"LOSS\",K$24:K211)-SUM(X$23:X210),\"\")","v":""}]
[null,"Row 212 (189)",null,58.71886049520306,null,14863.792934282561,null,148.6379293428256,null,null,-148.6379293428256,"LOSS",{"$f":"IF(COUNTA($F$6:$F$10)=5,(F213-F24)/F24,\"\")","v":0.47151550049397356},2,"middle",null,null,null,null,null,null,null,{"$f":"IF(AND(L212=\"WIN\",L213<>\"WIN\"),SUMIF(L$24:L212,\"WIN\",K$24:K212)-SUM(W$23:W211),\"\")","v":""},{"$f":"IF(AND(L212=\"LOSS\",L213<>\"LOSS\"),SUMIF(L$24:L212,\"LOSS\",K$24:K212)-SUM(X$23:X211),\"\")","v":""}]
[null,"Row 213 (190)",null,99.666949006224385,null,14715.155004939736,null,147.15155004939737,null,null,-147.15155004939737,"LOSS",{"$f":"IF(COUNTA($F$6:$F$10)=5,(F214-F24)/F24,\"\")","v":0.45680034548903387},3,"last",null,null,null,null,null,null,null,{"$f":"IF(AND(L213=\"WIN\",L214<>\"WIN\"),SUMIF(L$24:L213,\"WIN\",K$24:K213)-SUM(W$23:W212),\"\")","v":""},{"$f":"IF(AND(L213=\"LOSS\",L214<>\"LOSS\"),SUMIF(L$24:L213,\"LOSS\",K$24:K213)-SUM(X$23:X212),\"\")","v":-445.92880196073384}]
[null,"Row 214 (191)",null,39.15050941678313,null,14568.003454890339,null,145.68003454890339,null,null,174.81604145868405,"WIN",{"$f":"IF(COUNTA($F$6:$F$10)=5,(F215-F24)/F24,\"\")","v":0.47428194963490222},1,"last",null,null,null,null,null,null,null,{"$f":"IF(AND(L214=\"WIN\",L215<>\"WIN\"),SUMIF(L$24:L214,\"WIN\",K$24:K214)-SUM(W$23:W213),\"\")","v":174.81604145868369},{"$f":"IF(AND(L214=\"LOSS\",L215<>\"LOSS\"),SUMIF(L$24:L214,\"LOSS\",K$24:K214)-SUM(X$23:X213),\"\")","v":""}]
[null,"Row 215 (192)",null,97.332927539842032,null,14742.819496349022,null,147.42819496349023,null,null,-147.42819496349023,"LOSS",{"$f":"IF(COUNTA($F$6:$F$10)=5,(F216-F24)/F24,\"\")","v":0.45953913013855324},1,"last",null,null,null,null,null,null,null,{"$f":"IF(AND(L215=\"WIN\",L216<>\"WIN\"),SUMIF(L$24:L215,\"WIN\",K$24:K215)-SUM(W$23:W214),\"\")","v":""},{"$f":"IF(AND(L215=\"LOSS\",L216<>\"LOSS\"),SUMIF(L$24:L215,\"LOSS\",K$24:K215)-SUM(X$23:X214),\"\")","v":-147.42819496348966}]
[null,"Row 216 (193)",null,6.0657384272623016,null,14595.391301385533,null,145.95391301385533,null,null,175.14469561662639,"WIN",{"$f":"IF(COUNTA($F$6:$F$10)=5,(F217-F24)/F24,\"\")","v":0.47705359970021599},1,"new",null,null,null,null,null,null,null,{"$f":"IF(AND(L216=\"WIN\",L217<>\"WIN\"),SUMIF(L$24:L216,\"WIN\",K$24:K216)-SUM(W$23:W215),\"\")","v":""},{"$f":"IF(AND(L216=\"LOSS\",L217<>\"LOSS\"),SUMIF(L$24:L216,\"LOSS\",K$24:K216)-SUM(X$23:X215),\"\")","v":""}]
[null,"Row 217 (194)",null,{"$f":"IF(COUNTA($F$6:$F$10)=5,100*RAND(),\"\")","v":28.195661078895672},null,14770.53599700216,null,{"$f":"IF(COUNTBLANK($F$6:$F$10),\"\",F217*$F$7)","v":147.70535997002159},null,null,177.2464319640259,{"$f":"IF(D217=\"\",\"\",IF(D217<$F$8,\"WIN\",\"LOSS\"))","v":"WIN"},{"$f":"IF(COUNTA($F$6:$F$10)=5,(F218-F24)/F24,\"\")","v":0.49477824289661859},{"$f":"IF(L217=L216,N216+1,1)","v":2},{"$f":"IF(N217=1,IF(N218=1,\"last\",\"new\"),IF(N218=1,\"last\",\"middle\"))","v":"middle"},null,null,null,null,null,null,null,{"$f":"IF(AND(L217=\"WIN\",L218<>\"WIN\"),SUMIF(L$24:L217,\"WIN\",K$24:K217)-SUM(W$23:W216),\"\")","v":""},{"$f":"IF(AND(L217=\"LOSS\",L218<>\"LOSS\"),SUMIF(L$24:L217,\"LOSS\",K$24:K217)-SUM(X$23:X216),\"\")","v":""}]
[null,"Row 218 (195)",null,15.842761449590038,null,{"$f":"IF(COUNTBLANK($F$6:$F$10),\"\",IF(D217<$F$8,(1+$F$7*$F$9)*F217-$F$10,(1-$F$7)*F217-$F$10))","v":14947.782428966186},null,149.47782428966187,null,null,{"$f":"IF(COUNTBLANK($F$6:$F$10),\"\", IF(L218=\"win\", H218*$F$9-$F$10, IF(L218=\"loss\", -H218-$F$10)))","v":179.37338914759422},"WIN",{"$f":"IF(COUNTA($F$6:$F$10)=5,(F219-F24)/F24,\"\")","v":0.51271558181137811},3,"last",null,null,null,null,null,null,null,{"$f":"IF(AND(L218=\"WIN\",L219<>\"WIN\"),SUMIF(L$24:L218,\"WIN\",K$24:K218)-SUM(W$23:W217),\"\")","v":531.76451672824624},{"$f":"IF(AND(L218=\"LOSS\",L219<>\"LOSS\"),SUMIF(L$24:L218,\"LOSS\",K$24:K218)-SUM(X$23:X217),\"\")","v":""}]
[null,"Row 219 (196)",null,64.833901069033587,null,15127.155818113781,null,151.27155818113781,null,null,-151.27155818113781,"LOSS",{"$f":"IF(COUNTA($F$6:$F$10)=5,(F220-F24)/F24,\"\")","v":0.49758842599326436},1,"new",null,null,null,null,null,null,null,{"$f":"IF(AND(L219=\"WIN\",L220<>\"WIN\"),SUMIF(L$24:L219,\"WIN\",K$24:K219)-SUM(W$23:W218),\"\")","v":""},{"$f":"IF(AND(L219=\"LOSS\",L220<>\"LOSS\"),SUMIF(L$24:L219,\"LOSS\",K$24:K219)-SUM(X$23:X218),\"\")","v":""}]
[null,"Row 220 (197)",null,82.786317001000072,null,14975.884259932644,null,149.75884259932644,null,null,-149.75884259932644,"LOSS",{"$f":"IF(COUNTA($F$6:$F$10)=5,(F221-F24)/F24,\"\")","v":0.48261254173333162},2,"middle",null,null,null,null,null,null,null,{"$f":"IF(AND(L220=\"WIN\",L221<>\"WIN\"),SUMIF(L$24:L220,\"WIN\",K$24:K220)-SUM(W$23:W219),\"\")","v":""},{"$f":"IF(AND(L220=\"LOSS\",L221<>\"LOSS\"),SUMIF(L$24:L220,\"LOSS\",K$24:K220)-SUM(X$23:X219),\"\")","v":""}]
[null,"Row 221 (198)",null,69.8360056933425,null,14826.125417333316,null,148.26125417333316,null,null,-148.26125417333316,"LOSS",{"$f":"IF(COUNTA($F$6:$F$10)=5,(F222-F24)/F24,\"\")","v":0.46778641631599838},3,"middle",null,null,null,null,null,null,null,{"$f":"IF(AND(L221=\"WIN\",L222<>\"WIN\"),SUMIF(L$24:L221,\"WIN\",K$24:K221)-SUM(W$23:W220),\"\")","v":""},{"$f":"IF(AND(L221=\"LOSS\",L222<>\"LOSS\"),SUMIF(L$24:L221,\"LOSS\",K$24:K221)-SUM(X$23:X220),\"\")","v":""}]
[null,"Row 222 (199)",null,64.085430393270443,null,14677.864163159984,null,146.77864163159984,null,null,-146.77864163159984,"LOSS",{"$f":"IF(COUNTA($F$6:$F$10)=5,(F223-F24)/F24,\"\")","v":0.45310855215283846},4,"middle",null,null,null,null,null,null,null,{"$f":"IF(AND(L222=\"WIN\",L223<>\"WIN\"),SUMIF(L$24:L222,\"WIN\",K$24:K222)-SUM(W$23:W221),\"\")","v":""},{"$f":"IF(AND(L222=\"LOSS\",L223<>\"LOSS\"),SUMIF(L$24:L222,\"LOSS\",K$24:K222)-SUM(X$23:X221),\"\")","v":""}]
[null,"Row 223 (200)",null,87.886922639920044,null,14531.085521528385,null,145.31085521528385,null,null,-145.31085521528385,"LOSS",{"$f":"IF(COUNTA($F$6:$F$10)=5,(F224-F24)/F24,\"\")","v":0.43857746663131003},5,"last",null,null,null,null,null,null,null,{"$f":"IF(AND(L223=\"WIN\",L224<>\"WIN\"),SUMIF(L$24:L223,\"WIN\",K$24:K223)-SUM(W$23:W222),\"\")","v":""},{"$f":"IF(AND(L223=\"LOSS\",L224<>\"LOSS\"),SUMIF(L$24:L223,\"LOSS\",K$24:K223)-SUM(X$23:X222),\"\")","v":-741.38115180068053}]
[null,"Row 224 (201)",null,28.303787567098915,null,14385.7746663131,null,143.857746663131,null,null,172.62929599575719,"WIN",{"$f":"IF(COUNTA($F$6:$F$10)=5,(F225-F24)/F24,\"\")","v":0.45584039623088574},1,"new",null,null,null,null,null,null,null,{"$f":"IF(AND(L224=\"WIN\",L225<>\"WIN\"),SUMIF(L$24:L224,\"WIN\",K$24:K224)-SUM(W$23:W223),\"\")","v":""},{"$f":"IF(AND(L224=\"LOSS\",L225<>\"LOSS\"),SUMIF(L$24:L224,\"LOSS\",K$24:K224)-SUM(X$23:X223),\"\")","v":""}]
[null,"Row 225 (202)",null,19.853548906375419,null,14558.403962308857,null,145.58403962308859,null,null,174.7008475477063,"WIN",{"$f":"IF(COUNTA($F$6:$F$10)=5,(F226-F24)/F24,\"\")","v":0.47331048098565642},2,"middle",null,null,null,null,null,null,null,{"$f":"IF(AND(L225=\"WIN\",L226<>\"WIN\"),SUMIF(L$24:L225,\"WIN\",K$24:K225)-SUM(W$23:W224),\"\")","v":""},{"$f":"IF(AND(L225=\"LOSS\",L226<>\"LOSS\"),SUMIF(L$24:L225,\"LOSS\",K$24:K225)-SUM(X$23:X224),\"\")","v":""}]
[null,"Row 226 (203)",null,30.31730019126465,null,14733.104809856564,null,147.33104809856565,null,null,176.79725771827876,"WIN",{"$f":"IF(COUNTA($F$6:$F$10)=5,(F227-F24)/F24,\"\")","v":0.49099020675748434},3,"middle",null,null,null,null,null,null,null,{"$f":"IF(AND(L226=\"WIN\",L227<>\"WIN\"),SUMIF(L$24:L226,\"WIN\",K$24:K226)-SUM(W$23:W225),\"\")","v":""},{"$f":"IF(AND(L226=\"LOSS\",L227<>\"LOSS\"),SUMIF(L$24:L226,\"LOSS\",K$24:K226)-SUM(X$23:X225),\"\")","v":""}]
[null,"Row 227 (204)",null,21.816390378220586,null,14909.902067574843,null,149.09902067574845,null,null,178.91882481089814,"WIN",{"$f":"IF(COUNTA($F$6:$F$10)=5,(F228-F24)/F24,\"\")","v":0.50888208923857414},4,"middle",null,null,null,null,null,null,null,{"$f":"IF(AND(L227=\"WIN\",L228<>\"WIN\"),SUMIF(L$24:L227,\"WIN\",K$24:K227)-SUM(W$23:W226),\"\")","v":""},{"$f":"IF(AND(L227=\"LOSS\",L228<>\"LOSS\"),SUMIF(L$24:L227,\"LOSS\",K$24:K227)-SUM(X$23:X226),\"\")","v":""}]
[null,"Row 228 (205)",null,53.081180351298308,null,15088.820892385742,null,150.88820892385743,null,null,181.06585070862891,"WIN",{"$f":"IF(COUNTA($F$6:$F$10)=5,(F229-F24)/F24,\"\")","v":0.52698867430943697},5,"middle",null,null,null,null,null,null,null,{"$f":"IF(AND(L228=\"WIN\",L229<>\"WIN\"),SUMIF(L$24:L228,\"WIN\",K$24:K228)-SUM(W$23:W227),\"\")","v":""},{"$f":"IF(AND(L228=\"LOSS\",L229<>\"LOSS\"),SUMIF(L$24:L228,\"LOSS\",K$24:K228)-SUM(X$23:X227),\"\")","v":""}]
[null,"Row 229 (206)",null,6.6905033393812712,null,15269.88674309437,null,152.69886743094369,null,null,183.23864091713241,"WIN",{"$f":"IF(COUNTA($F$6:$F$10)=5,(F230-F24)/F24,\"\")","v":0.54531253840115024},6,"last",null,null,null,null,null,null,null,{"$f":"IF(AND(L229=\"WIN\",L230<>\"WIN\"),SUMIF(L$24:L229,\"WIN\",K$24:K229)-SUM(W$23:W228),\"\")","v":1067.3507176984021},{"$f":"IF(AND(L229=\"LOSS\",L230<>\"LOSS\"),SUMIF(L$24:L229,\"LOSS\",K$24:K229)-SUM(X$23:X228),\"\")","v":""}]
[null,"Row 230 (207)",null,63.734905414118835,null,15453.125384011502,null,154.53125384011503,null,null,-154.53125384011503,"LOSS",{"$f":"IF(COUNTA($F$6:$F$10)=5,(F231-F24)/F24,\"\")","v":0.52985941301713868},1,"last",null,null,null,null,null,null,null,{"$f":"IF(AND(L230=\"WIN\",L231<>\"WIN\"),SUMIF(L$24:L230,\"WIN\",K$24:K230)-SUM(W$23:W229),\"\")","v":""},{"$f":"IF(AND(L230=\"LOSS\",L231<>\"LOSS\"),SUMIF(L$24:L230,\"LOSS\",K$24:K230)-SUM(X$23:X229),\"\")","v":-154.53125384011582}]
[null,"Row 231 (208)",null,6.5772637433231917,null,15298.594130171386,null,152.98594130171386,null,null,183.58312956205663,"WIN",{"$f":"IF(COUNTA($F$6:$F$10)=5,(F232-F24)/F24,\"\")","v":0.54821772597334439},1,"last",null,null,null,null,null,null,null,{"$f":"IF(AND(L231=\"WIN\",L232<>\"WIN\"),SUMIF(L$24:L231,\"WIN\",K$24:K231)-SUM(W$23:W230),\"\")","v":183.58312956205555},{"$f":"IF(AND(L231=\"LOSS\",L232<>\"LOSS\"),SUMIF(L$24:L231,\"LOSS\",K$24:K231)-SUM(X$23:X230),\"\")","v":""}]
[null,"Row 232 (209)",null,61.216681886750536,null,15482.177259733444,null,154.82177259733444,null,null,-154.82177259733444,"LOSS",{"$f":"IF(COUNTA($F$6:$F$10)=5,(F233-F24)/F24,\"\")","v":0.53273554871361084},1,"new",null,null,null,null,null,null,null,{"$f":"IF(AND(L232=\"WIN\",L233<>\"WIN\"),SUMIF(L$24:L232,\"WIN\",K$24:K232)-SUM(W$23:W231),\"\")","v":""},{"$f":"IF(AND(L232=\"LOSS\",L233<>\"LOSS\"),SUMIF(L$24:L232,\"LOSS\",K$24:K232)-SUM(X$23:X231),\"\")","v":""}]
[null,"Row 233 (210)",null,71.06976918626826,null,15327.355487136108,null,153.27355487136109,null,null,-153.27355487136109,"LOSS",{"$f":"IF(COUNTA($F$6:$F$10)=5,(F234-F24)/F24,\"\")","v":0.5174081932264748},2,"last",null,null,null,null,null,null,null,{"$f":"IF(AND(L233=\"WIN\",L234<>\"WIN\"),SUMIF(L$24:L233,\"WIN\",K$24:K233)-SUM(W$23:W232),\"\")","v":""},{"$f":"IF(AND(L233=\"LOSS\",L234<>\"LOSS\"),SUMIF(L$24:L233,\"LOSS\",K$24:K233)-SUM(X$23:X232),\"\")","v":-308.09532746869445}]
[null,"Row 234 (211)",null,15.951333131971079,null,15174.081932264748,null,151.74081932264747,null,null,182.08898318717695,"WIN",{"$f":"IF(COUNTA($F$6:$F$10)=5,(F235-F24)/F24,\"\")","v":0.53561709154519244},1,"last",null,null,null,null,null,null,null,{"$f":"IF(AND(L234=\"WIN\",L235<>\"WIN\"),SUMIF(L$24:L234,\"WIN\",K$24:K234)-SUM(W$23:W233),\"\")","v":182.08898318717547},{"$f":"IF(AND(L234=\"LOSS\",L235<>\"LOSS\"),SUMIF(L$24:L234,\"LOSS\",K$24:K234)-SUM(X$23:X233),\"\")","v":""}]
[null,"Row 235 (212)",null,91.082971910583169,null,15356.170915451925,null,153.56170915451926,null,null,-153.56170915451926,"LOSS",{"$f":"IF(COUNTA($F$6:$F$10)=5,(F236-F24)/F24,\"\")","v":0.52026092062974061},1,"last",null,null,null,null,null,null,null,{"$f":"IF(AND(L235=\"WIN\",L236<>\"WIN\"),SUMIF(L$24:L235,\"WIN\",K$24:K235)-SUM(W$23:W234),\"\")","v":""},{"$f":"IF(AND(L235=\"LOSS\",L236<>\"LOSS\"),SUMIF(L$24:L235,\"LOSS\",K$24:K235)-SUM(X$23:X234),\"\")","v":-153.56170915451912}]
[null,"Row 236 (213)",null,29.772561801884578,null,15202.609206297406,null,152.02609206297407,null,null,182.43131047556889,"WIN",{"$f":"IF(COUNTA($F$6:$F$10)=5,(F237-F24)/F24,\"\")","v":0.53850405167729753},1,"new",null,null,null,null,null,null,null,{"$f":"IF(AND(L236=\"WIN\",L237<>\"WIN\"),SUMIF(L$24:L236,\"WIN\",K$24:K236)-SUM(W$23:W235),\"\")","v":""},{"$f":"IF(AND(L236=\"LOSS\",L237<>\"LOSS\"),SUMIF(L$24:L236,\"LOSS\",K$24:K236)-SUM(X$23:X235),\"\")","v":""}]
[null,"Row 237 (214)",null,17.493438293343942,null,15385.040516772975,null,153.85040516772975,null,null,184.6204862012757,"WIN",{"$f":"IF(COUNTA($F$6:$F$10)=5,(F238-F24)/F24,\"\")","v":0.5569661002974251},2,"middle",null,null,null,null,null,null,null,{"$f":"IF(AND(L237=\"WIN\",L238<>\"WIN\"),SUMIF(L$24:L237,\"WIN\",K$24:K237)-SUM(W$23:W236),\"\")","v":""},{"$f":"IF(AND(L237=\"LOSS\",L238<>\"LOSS\"),SUMIF(L$24:L237,\"LOSS\",K$24:K237)-SUM(X$23:X236),\"\")","v":""}]
[null,"Row 238 (215)",null,37.400608042609704,null,15569.661002974251,null,155.69661002974252,null,null,186.835932035691,"WIN",{"$f":"IF(COUNTA($F$6:$F$10)=5,(F239-F24)/F24,\"\")","v":0.57564969350099415},3,"middle",null,null,null,null,null,null,null,{"$f":"IF(AND(L238=\"WIN\",L239<>\"WIN\"),SUMIF(L$24:L238,\"WIN\",K$24:K238)-SUM(W$23:W237),\"\")","v":""},{"$f":"IF(AND(L238=\"LOSS\",L239<>\"LOSS\"),SUMIF(L$24:L238,\"LOSS\",K$24:K238)-SUM(X$23:X237),\"\")","v":""}]
[null,"Row 239 (216)",null,21.018532878293549,null,15756.496935009942,null,157.56496935009943,null,null,189.0779632201193,"WIN",{"$f":"IF(COUNTA($F$6:$F$10)=5,(F240-F24)/F24,\"\")","v":0.59455748982300616},4,"middle",null,null,null,null,null,null,null,{"$f":"IF(AND(L239=\"WIN\",L240<>\"WIN\"),SUMIF(L$24:L239,\"WIN\",K$24:K239)-SUM(W$23:W238),\"\")","v":""},{"$f":"IF(AND(L239=\"LOSS\",L240<>\"LOSS\"),SUMIF(L$24:L239,\"LOSS\",K$24:K239)-SUM(X$23:X238),\"\")","v":""}]
[null,"Row 240 (217)",null,8.3914624723842035,null,15945.574898230061,null,159.45574898230061,null,null,191.34689877876073,"WIN",{"$f":"IF(COUNTA($F$6:$F$10)=5,(F241-F24)/F24,\"\")","v":0.61369217970088208},5,"last",null,null,null,null,null,null,null,{"$f":"IF(AND(L240=\"WIN\",L241<>\"WIN\"),SUMIF(L$24:L240,\"WIN\",K$24:K240)-SUM(W$23:W239),\"\")","v":934.31259071141176},{"$f":"IF(AND(L240=\"LOSS\",L241<>\"LOSS\"),SUMIF(L$24:L240,\"LOSS\",K$24:K240)-SUM(X$23:X239),\"\")","v":""}]
[null,"Row 241 (218)",null,67.649242283285787,null,16136.921797008821,null,161.36921797008821,null,null,-161.36921797008821,"LOSS",{"$f":"IF(COUNTA($F$6:$F$10)=5,(F242-F24)/F24,\"\")","v":0.59755525790387332},1,"last",null,null,null,null,null,null,null,{"$f":"IF(AND(L241=\"WIN\",L242<>\"WIN\"),SUMIF(L$24:L241,\"WIN\",K$24:K241)-SUM(W$23:W240),\"\")","v":""},{"$f":"IF(AND(L241=\"LOSS\",L242<>\"LOSS\"),SUMIF(L$24:L241,\"LOSS\",K$24:K241)-SUM(X$23:X240),\"\")","v":-161.36921797008836}]
[null,"Row 242 (219)",null,52.623319109508081,null,15975.552579038733,null,159.75552579038734,null,null,191.70663094846481,"WIN",{"$f":"IF(COUNTA($F$6:$F$10)=5,(F243-F24)/F24,\"\")","v":0.61672592099871981},1,"new",null,null,null,null,null,null,null,{"$f":"IF(AND(L242=\"WIN\",L243<>\"WIN\"),SUMIF(L$24:L242,\"WIN\",K$24:K242)-SUM(W$23:W241),\"\")","v":""},{"$f":"IF(AND(L242=\"LOSS\",L243<>\"LOSS\"),SUMIF(L$24:L242,\"LOSS\",K$24:K242)-SUM(X$23:X241),\"\")","v":""}]
[null,"Row 243 (220)",null,30.745883360714011,null,16167.259209987198,null,161.67259209987199,null,null,194.00711051984638,"WIN",{"$f":"IF(COUNTA($F$6:$F$10)=5,(F244-F24)/F24,\"\")","v":0.63612663205070441},2,"last",null,null,null,null,null,null,null,{"$f":"IF(AND(L243=\"WIN\",L244<>\"WIN\"),SUMIF(L$24:L243,\"WIN\",K$24:K243)-SUM(W$23:W242),\"\")","v":385.71374146831295},{"$f":"IF(AND(L243=\"LOSS\",L244<>\"LOSS\"),SUMIF(L$24:L243,\"LOSS\",K$24:K243)-SUM(X$23:X242),\"\")","v":""}]
[null,"Row 244 (221)",null,99.322360056859011,null,16361.266320507044,null,163.61266320507045,null,null,-163.61266320507045,"LOSS",{"$f":"IF(COUNTA($F$6:$F$10)=5,(F245-F24)/F24,\"\")","v":0.61976536573019725},1,"new",null,null,null,null,null,null,null,{"$f":"IF(AND(L244=\"WIN\",L245<>\"WIN\"),SUMIF(L$24:L244,\"WIN\",K$24:K244)-SUM(W$23:W243),\"\")","v":""},{"$f":"IF(AND(L244=\"LOSS\",L245<>\"LOSS\"),SUMIF(L$24:L244,\"LOSS\",K$24:K244)-SUM(X$23:X243),\"\")","v":""}]
[null,"Row 245 (222)",null,88.420497826884315,null,16197.653657301973,null,161.97653657301973,null,null,-161.97653657301973,"LOSS",{"$f":"IF(COUNTA($F$6:$F$10)=5,(F246-F24)/F24,\"\")","v":0.60356771207289528},2,"last",null,null,null,null,null,null,null,{"$f":"IF(AND(L245=\"WIN\",L246<>\"WIN\"),SUMIF(L$24:L245,\"WIN\",K$24:K245)-SUM(W$23:W244),\"\")","v":""},{"$f":"IF(AND(L245=\"LOSS\",L246<>\"LOSS\"),SUMIF(L$24:L245,\"LOSS\",K$24:K245)-SUM(X$23:X244),\"\")","v":-325.58919977809092}]
[null,"Row 246 (223)",null,15.579492471090784,null,16035.677120728953,null,160.35677120728954,null,null,192.42812544874744,"WIN",{"$f":"IF(COUNTA($F$6:$F$10)=5,(F247-F24)/F24,\"\")","v":0.62281052461776998},1,"new",null,null,null,null,null,null,null,{"$f":"IF(AND(L246=\"WIN\",L247<>\"WIN\"),SUMIF(L$24:L246,\"WIN\",K$24:K246)-SUM(W$23:W245),\"\")","v":""},{"$f":"IF(AND(L246=\"LOSS\",L247<>\"LOSS\"),SUMIF(L$24:L246,\"LOSS\",K$24:K246)-SUM(X$23:X245),\"\")","v":""}]
[null,"Row 247 (224)",null,40.403553139135632,null,16228.1052461777,null,162.28105246177699,null,null,194.73726295413238,"WIN",{"$f":"IF(COUNTA($F$6:$F$10)=5,(F248-F24)/F24,\"\")","v":0.64228425091318309},2,"last",null,null,null,null,null,null,null,{"$f":"IF(AND(L247=\"WIN\",L248<>\"WIN\"),SUMIF(L$24:L247,\"WIN\",K$24:K247)-SUM(W$23:W246),\"\")","v":387.16538840287831},{"$f":"IF(AND(L247=\"LOSS\",L248<>\"LOSS\"),SUMIF(L$24:L247,\"LOSS\",K$24:K247)-SUM(X$23:X246),\"\")","v":""}]
[null,"Row 248 (225)",null,78.299418295121498,null,16422.842509131831,null,164.22842509131831,null,null,-164.22842509131831,"LOSS",{"$f":"IF(COUNTA($F$6:$F$10)=5,(F249-F24)/F24,\"\")","v":0.62586140840405136},1,"last",null,null,null,null,null,null,null,{"$f":"IF(AND(L248=\"WIN\",L249<>\"WIN\"),SUMIF(L$24:L248,\"WIN\",K$24:K248)-SUM(W$23:W247),\"\")","v":""},{"$f":"IF(AND(L248=\"LOSS\",L249<>\"LOSS\"),SUMIF(L$24:L248,\"LOSS\",K$24:K248)-SUM(X$23:X247),\"\")","v":-164.22842509131806}]
[null,"Row 249 (226)",null,49.662370634934618,null,16258.614084040513,null,162.58614084040514,null,null,195.10336900848617,"WIN",{"$f":"IF(COUNTA($F$6:$F$10)=5,(F250-F24)/F24,\"\")","v":0.64537174530490016},1,"new",null,null,null,null,null,null,null,{"$f":"IF(AND(L249=\"WIN\",L250<>\"WIN\"),SUMIF(L$24:L249,\"WIN\",K$24:K249)-SUM(W$23:W248),\"\")","v":""},{"$f":"IF(AND(L249=\"LOSS\",L250<>\"LOSS\"),SUMIF(L$24:L249,\"LOSS\",K$24:K249)-SUM(X$23:X248),\"\")","v":""}]
[null,"Row 250 (227)",null,45.672816939780112,null,16453.717453049001,null,164.53717453049001,null,null,197.444609436588,"WIN",{"$f":"IF(COUNTA($F$6:$F$10)=5,(F251-F24)/F24,\"\")","v":0.66511620624855894},2,"last",null,null,null,null,null,null,null,{"$f":"IF(AND(L250=\"WIN\",L251<>\"WIN\"),SUMIF(L$24:L250,\"WIN\",K$24:K250)-SUM(W$23:W249),\"\")","v":392.5479784450763},{"$f":"IF(AND(L250=\"LOSS\",L251<>\"LOSS\"),SUMIF(L$24:L250,\"LOSS\",K$24:K250)-SUM(X$23:X249),\"\")","v":""}]
[null,"Row 251 (228)",null,95.407328076968639,null,16651.16206248559,null,166.51162062485591,null,null,-166.51162062485591,"LOSS",{"$f":"IF(COUNTA($F$6:$F$10)=5,(F252-F24)/F24,\"\")","v":0.64846504418607331},1,"last",null,null,null,null,null,null,null,{"$f":"IF(AND(L251=\"WIN\",L252<>\"WIN\"),SUMIF(L$24:L251,\"WIN\",K$24:K251)-SUM(W$23:W250),\"\")","v":""},{"$f":"IF(AND(L251=\"LOSS\",L252<>\"LOSS\"),SUMIF(L$24:L251,\"LOSS\",K$24:K251)-SUM(X$23:X250),\"\")","v":-166.51162062485673}]
[null,"Row 252 (229)",null,22.771956615780951,null,16484.650441860733,null,164.84650441860734,null,null,197.81580530232881,"WIN",{"$f":"IF(COUNTA($F$6:$F$10)=5,(F253-F24)/F24,\"\")","v":0.66824662471630614},1,"new",null,null,null,null,null,null,null,{"$f":"IF(AND(L252=\"WIN\",L253<>\"WIN\"),SUMIF(L$24:L252,\"WIN\",K$24:K252)-SUM(W$23:W251),\"\")","v":""},{"$f":"IF(AND(L252=\"LOSS\",L253<>\"LOSS\"),SUMIF(L$24:L252,\"LOSS\",K$24:K252)-SUM(X$23:X251),\"\")","v":""}]
[null,"Row 253 (230)",null,19.551317866527363,null,16682.466247163062,null,166.82466247163063,null,null,200.18959496595676,"WIN",{"$f":"IF(COUNTA($F$6:$F$10)=5,(F254-F24)/F24,\"\")","v":0.68826558421290174},2,"last",null,null,null,null,null,null,null,{"$f":"IF(AND(L253=\"WIN\",L254<>\"WIN\"),SUMIF(L$24:L253,\"WIN\",K$24:K253)-SUM(W$23:W252),\"\")","v":398.00540026828457},{"$f":"IF(AND(L253=\"LOSS\",L254<>\"LOSS\"),SUMIF(L$24:L253,\"LOSS\",K$24:K253)-SUM(X$23:X252),\"\")","v":""}]
[null,"Row 254 (231)",null,79.591828905413209,null,16882.655842129017,null,168.82655842129017,null,null,-168.82655842129017,"LOSS",{"$f":"IF(COUNTA($F$6:$F$10)=5,(F255-F24)/F24,\"\")","v":0.67138292837077274},1,"new",null,null,null,null,null,null,null,{"$f":"IF(AND(L254=\"WIN\",L255<>\"WIN\"),SUMIF(L$24:L254,\"WIN\",K$24:K254)-SUM(W$23:W253),\"\")","v":""},{"$f":"IF(AND(L254=\"LOSS\",L255<>\"LOSS\"),SUMIF(L$24:L254,\"LOSS\",K$24:K254)-SUM(X$23:X253),\"\")","v":""}]
[null,"Row 255 (232)",null,62.475502555508434,null,16713.829283707728,null,167.13829283707727,null,null,-167.13829283707727,"LOSS",{"$f":"IF(COUNTA($F$6:$F$10)=5,(F256-F24)/F24,\"\")","v":0.65466909908706516},2,"last",null,null,null,null,null,null,null,{"$f":"IF(AND(L255=\"WIN\",L256<>\"WIN\"),SUMIF(L$24:L255,\"WIN\",K$24:K255)-SUM(W$23:W254),\"\")","v":""},{"$f":"IF(AND(L255=\"LOSS\",L256<>\"LOSS\"),SUMIF(L$24:L255,\"LOSS\",K$24:K255)-SUM(X$23:X254),\"\")","v":-335.96485125836625}]
[null,"Row 256 (233)",null,38.424562860252422,null,16546.690990870651,null,165.46690990870653,null,null,198.56029189044781,"WIN",{"$f":"IF(COUNTA($F$6:$F$10)=5,(F257-F24)/F24,\"\")","v":0.67452512827610989},1,"new",null,null,null,null,null,null,null,{"$f":"IF(AND(L256=\"WIN\",L257<>\"WIN\"),SUMIF(L$24:L256,\"WIN\",K$24:K256)-SUM(W$23:W255),\"\")","v":""},{"$f":"IF(AND(L256=\"LOSS\",L257<>\"LOSS\"),SUMIF(L$24:L256,\"LOSS\",K$24:K256)-SUM(X$23:X255),\"\")","v":""}]
[null,"Row 257 (234)",null,3.2378963849174491,null,16745.251282761099,null,167.452512827611,null,null,200.94301539313321,"WIN",{"$f":"IF(COUNTA($F$6:$F$10)=5,(F258-F24)/F24,\"\")","v":0.69461942981542302},2,"middle",null,null,null,null,null,null,null,{"$f":"IF(AND(L257=\"WIN\",L258<>\"WIN\"),SUMIF(L$24:L257,\"WIN\",K$24:K257)-SUM(W$23:W256),\"\")","v":""},{"$f":"IF(AND(L257=\"LOSS\",L258<>\"LOSS\"),SUMIF(L$24:L257,\"LOSS\",K$24:K257)-SUM(X$23:X256),\"\")","v":""}]
[null,"Row 258 (235)",null,46.617301547770474,null,16946.194298154231,null,169.46194298154231,null,null,203.35433157785076,"WIN",{"$f":"IF(COUNTA($F$6:$F$10)=5,(F259-F24)/F24,\"\")","v":0.71495486297320821},3,"middle",null,null,null,null,null,null,null,{"$f":"IF(AND(L258=\"WIN\",L259<>\"WIN\"),SUMIF(L$24:L258,\"WIN\",K$24:K258)-SUM(W$23:W257),\"\")","v":""},{"$f":"IF(AND(L258=\"LOSS\",L259<>\"LOSS\"),SUMIF(L$24:L258,\"LOSS\",K$24:K258)-SUM(X$23:X257),\"\")","v":""}]
[null,"Row 259 (236)",null,13.759956463101375,null,17149.548629732082,null,171.49548629732084,null,null,205.794583556785,"WIN",{"$f":"IF(COUNTA($F$6:$F$10)=5,(F260-F24)/F24,\"\")","v":0.73553432132888663},4,"middle",null,null,null,null,null,null,null,{"$f":"IF(AND(L259=\"WIN\",L260<>\"WIN\"),SUMIF(L$24:L259,\"WIN\",K$24:K259)-SUM(W$23:W258),\"\")","v":""},{"$f":"IF(AND(L259=\"LOSS\",L260<>\"LOSS\"),SUMIF(L$24:L259,\"LOSS\",K$24:K259)-SUM(X$23:X258),\"\")","v":""}]
[null,"Row 260 (237)",null,43.998016484233069,null,17355.343213288867,null,173.55343213288867,null,null,208.2641185594664,"WIN",{"$f":"IF(COUNTA($F$6:$F$10)=5,(F261-F24)/F24,\"\")","v":0.75636073318483321},5,"middle",null,null,null,null,null,null,null,{"$f":"IF(AND(L260=\"WIN\",L261<>\"WIN\"),SUMIF(L$24:L260,\"WIN\",K$24:K260)-SUM(W$23:W259),\"\")","v":""},{"$f":"IF(AND(L260=\"LOSS\",L261<>\"LOSS\"),SUMIF(L$24:L260,\"LOSS\",K$24:K260)-SUM(X$23:X259),\"\")","v":""}]
[null,"Row 261 (238)",null,47.640428965009583,null,17563.607331848332,null,175.63607331848331,null,null,210.76328798217997,"WIN",{"$f":"IF(COUNTA($F$6:$F$10)=5,(F262-F24)/F24,\"\")","v":0.77743706198305118},6,"middle",null,null,null,null,null,null,null,{"$f":"IF(AND(L261=\"WIN\",L262<>\"WIN\"),SUMIF(L$24:L261,\"WIN\",K$24:K261)-SUM(W$23:W260),\"\")","v":""},{"$f":"IF(AND(L261=\"LOSS\",L262<>\"LOSS\"),SUMIF(L$24:L261,\"LOSS\",K$24:K261)-SUM(X$23:X260),\"\")","v":""}]
[null,"Row 262 (239)",null,7.5665910120264694,null,17774.370619830512,null,177.74370619830512,null,null,213.29244743796613,"WIN",{"$f":"IF(COUNTA($F$6:$F$10)=5,(F263-F24)/F24,\"\")","v":0.79876630672684767},7,"middle",null,null,null,null,null,null,null,{"$f":"IF(AND(L262=\"WIN\",L263<>\"WIN\"),SUMIF(L$24:L262,\"WIN\",K$24:K262)-SUM(W$23:W261),\"\")","v":""},{"$f":"IF(AND(L262=\"LOSS\",L263<>\"LOSS\"),SUMIF(L$24:L262,\"LOSS\",K$24:K262)-SUM(X$23:X261),\"\")","v":""}]
[null,"Row 263 (240)",null,50.890657387855597,null,17987.663067268477,null,179.87663067268477,null,null,215.85195680722171,"WIN",{"$f":"IF(COUNTA($F$6:$F$10)=5,(F264-F24)/F24,\"\")","v":0.82035150240756993},8,"middle",null,null,null,null,null,null,null,{"$f":"IF(AND(L263=\"WIN\",L264<>\"WIN\"),SUMIF(L$24:L263,\"WIN\",K$24:K263)-SUM(W$23:W262),\"\")","v":""},{"$f":"IF(AND(L263=\"LOSS\",L264<>\"LOSS\"),SUMIF(L$24:L263,\"LOSS\",K$24:K263)-SUM(X$23:X262),\"\")","v":""}]
[null,"Row 264 (241)",null,28.642404470134821,null,18203.515024075699,null,182.03515024075699,null,null,218.44218028890839,"WIN",{"$f":"IF(COUNTA($F$6:$F$10)=5,(F265-F24)/F24,\"\")","v":0.84219572043646074},9,"middle",null,null,null,null,null,null,null,{"$f":"IF(AND(L264=\"WIN\",L265<>\"WIN\"),SUMIF(L$24:L264,\"WIN\",K$24:K264)-SUM(W$23:W263),\"\")","v":""},{"$f":"IF(AND(L264=\"LOSS\",L265<>\"LOSS\"),SUMIF(L$24:L264,\"LOSS\",K$24:K264)-SUM(X$23:X263),\"\")","v":""}]
[null,"Row 265 (242)",null,49.66909126910253,null,18421.957204364608,null,184.21957204364608,null,null,221.06348645237529,"WIN",{"$f":"IF(COUNTA($F$6:$F$10)=5,(F266-F24)/F24,\"\")","v":0.86430206908169815},10,"last",null,null,null,null,null,null,null,{"$f":"IF(AND(L265=\"WIN\",L266<>\"WIN\"),SUMIF(L$24:L265,\"WIN\",K$24:K265)-SUM(W$23:W264),\"\")","v":2096.3296999463309},{"$f":"IF(AND(L265=\"LOSS\",L266<>\"LOSS\"),SUMIF(L$24:L265,\"LOSS\",K$24:K265)-SUM(X$23:X264),\"\")","v":""}]
[null,"Row 266 (243)",null,63.286719114998682,null,18643.020690816982,null,186.43020690816982,null,null,-186.43020690816982,"LOSS",{"$f":"IF(COUNTA($F$6:$F$10)=5,(F267-F24)/F24,\"\")","v":0.84565904839088102},1,"new",null,null,null,null,null,null,null,{"$f":"IF(AND(L266=\"WIN\",L267<>\"WIN\"),SUMIF(L$24:L266,\"WIN\",K$24:K266)-SUM(W$23:W265),\"\")","v":""},{"$f":"IF(AND(L266=\"LOSS\",L267<>\"LOSS\"),SUMIF(L$24:L266,\"LOSS\",K$24:K266)-SUM(X$23:X265),\"\")","v":""}]
[null,"Row 267 (244)",null,84.014838421712625,null,18456.590483908811,null,184.56590483908812,null,null,-184.56590483908812,"LOSS",{"$f":"IF(COUNTA($F$6:$F$10)=5,(F268-F24)/F24,\"\")","v":0.82720245790697222},2,"last",null,null,null,null,null,null,null,{"$f":"IF(AND(L267=\"WIN\",L268<>\"WIN\"),SUMIF(L$24:L267,\"WIN\",K$24:K267)-SUM(W$23:W266),\"\")","v":""},{"$f":"IF(AND(L267=\"LOSS\",L268<>\"LOSS\"),SUMIF(L$24:L267,\"LOSS\",K$24:K267)-SUM(X$23:X266),\"\")","v":-370.9961117472576}]
[null,"Row 268 (245)",null,15.79638684139849,null,18272.024579069723,null,182.72024579069722,null,null,219.26429494883666,"WIN",{"$f":"IF(COUNTA($F$6:$F$10)=5,(F269-F24)/F24,\"\")","v":0.84912888740185588},1,"last",null,null,null,null,null,null,null,{"$f":"IF(AND(L268=\"WIN\",L269<>\"WIN\"),SUMIF(L$24:L268,\"WIN\",K$24:K268)-SUM(W$23:W267),\"\")","v":219.26429494883632},{"$f":"IF(AND(L268=\"LOSS\",L269<>\"LOSS\"),SUMIF(L$24:L268,\"LOSS\",K$24:K268)-SUM(X$23:X267),\"\")","v":""}]
[null,"Row 269 (246)",null,80.130500562448489,null,18491.288874018559,null,184.91288874018559,null,null,-184.91288874018559,"LOSS",{"$f":"IF(COUNTA($F$6:$F$10)=5,(F270-F24)/F24,\"\")","v":0.83063759852783736},1,"new",null,null,null,null,null,null,null,{"$f":"IF(AND(L269=\"WIN\",L270<>\"WIN\"),SUMIF(L$24:L269,\"WIN\",K$24:K269)-SUM(W$23:W268),\"\")","v":""},{"$f":"IF(AND(L269=\"LOSS\",L270<>\"LOSS\"),SUMIF(L$24:L269,\"LOSS\",K$24:K269)-SUM(X$23:X268),\"\")","v":""}]
[null,"Row 270 (247)",null,71.139262099507093,null,18306.375985278373,null,183.06375985278373,null,null,-183.06375985278373,"LOSS",{"$f":"IF(COUNTA($F$6:$F$10)=5,(F271-F24)/F24,\"\")","v":0.81233122254255907},2,"last",null,null,null,null,null,null,null,{"$f":"IF(AND(L270=\"WIN\",L271<>\"WIN\"),SUMIF(L$24:L270,\"WIN\",K$24:K270)-SUM(W$23:W269),\"\")","v":""},{"$f":"IF(AND(L270=\"LOSS\",L271<>\"LOSS\"),SUMIF(L$24:L270,\"LOSS\",K$24:K270)-SUM(X$23:X269),\"\")","v":-367.97664859296856}]
[null,"Row 271 (248)",null,51.521864157559492,null,18123.31222542559,null,181.2331222542559,null,null,217.47974670510709,"WIN",{"$f":"IF(COUNTA($F$6:$F$10)=5,(F272-F24)/F24,\"\")","v":0.83407919721306967},1,"last",null,null,null,null,null,null,null,{"$f":"IF(AND(L271=\"WIN\",L272<>\"WIN\"),SUMIF(L$24:L271,\"WIN\",K$24:K271)-SUM(W$23:W270),\"\")","v":217.47974670510666},{"$f":"IF(AND(L271=\"LOSS\",L272<>\"LOSS\"),SUMIF(L$24:L271,\"LOSS\",K$24:K271)-SUM(X$23:X270),\"\")","v":""}]
[null,"Row 272 (249)",null,78.839795206144771,null,18340.791972130697,null,183.40791972130697,null,null,-183.40791972130697,"LOSS",{"$f":"IF(COUNTA($F$6:$F$10)=5,(F273-F24)/F24,\"\")","v":0.81573840524093899},1,"last",null,null,null,null,null,null,null,{"$f":"IF(AND(L272=\"WIN\",L273<>\"WIN\"),SUMIF(L$24:L272,\"WIN\",K$24:K272)-SUM(W$23:W271),\"\")","v":""},{"$f":"IF(AND(L272=\"LOSS\",L273<>\"LOSS\"),SUMIF(L$24:L272,\"LOSS\",K$24:K272)-SUM(X$23:X271),\"\")","v":-183.40791972130683}]
[null,"Row 273 (250)",null,23.35732274697504,null,18157.38405240939,null,181.5738405240939,null,null,217.88860862891266,"WIN",{"$f":"IF(COUNTA($F$6:$F$10)=5,(F274-F24)/F24,\"\")","v":0.83752726610383033},1,"new",null,null,null,null,null,null,null,{"$f":"IF(AND(L273=\"WIN\",L274<>\"WIN\"),SUMIF(L$24:L273,\"WIN\",K$24:K273)-SUM(W$23:W272),\"\")","v":""},{"$f":"IF(AND(L273=\"LOSS\",L274<>\"LOSS\"),SUMIF(L$24:L273,\"LOSS\",K$24:K273)-SUM(X$23:X272),\"\")","v":""}]
[null,"Row 274 (251)",null,50.093518183532751,null,18375.272661038303,null,183.75272661038304,null,null,220.50327193245963,"WIN",{"$f":"IF(COUNTA($F$6:$F$10)=5,(F275-F24)/F24,\"\")","v":0.85957759329707628},2,"middle",null,null,null,null,null,null,null,{"$f":"IF(AND(L274=\"WIN\",L275<>\"WIN\"),SUMIF(L$24:L274,\"WIN\",K$24:K274)-SUM(W$23:W273),\"\")","v":""},{"$f":"IF(AND(L274=\"LOSS\",L275<>\"LOSS\"),SUMIF(L$24:L274,\"LOSS\",K$24:K274)-SUM(X$23:X273),\"\")","v":""}]
[null,"Row 275 (252)",null,51.602096826959688,null,18595.775932970762,null,185.95775932970761,null,null,223.14931119564912,"WIN",{"$f":"IF(COUNTA($F$6:$F$10)=5,(F276-F24)/F24,\"\")","v":0.88189252441664101},3,"last",null,null,null,null,null,null,null,{"$f":"IF(AND(L275=\"WIN\",L276<>\"WIN\"),SUMIF(L$24:L275,\"WIN\",K$24:K275)-SUM(W$23:W274),\"\")","v":661.54119175701999},{"$f":"IF(AND(L275=\"LOSS\",L276<>\"LOSS\"),SUMIF(L$24:L275,\"LOSS\",K$24:K275)-SUM(X$23:X274),\"\")","v":""}]
[null,"Row 276 (253)",null,77.678963069042112,null,18818.92524416641,null,188.18925244166411,null,null,-188.18925244166411,"LOSS",{"$f":"IF(COUNTA($F$6:$F$10)=5,(F277-F24)/F24,\"\")","v":0.8630735991724745},1,"new",null,null,null,null,null,null,null,{"$f":"IF(AND(L276=\"WIN\",L277<>\"WIN\"),SUMIF(L$24:L276,\"WIN\",K$24:K276)-SUM(W$23:W275),\"\")","v":""},{"$f":"IF(AND(L276=\"LOSS\",L277<>\"LOSS\"),SUMIF(L$24:L276,\"LOSS\",K$24:K276)-SUM(X$23:X275),\"\")","v":""}]
[null,"Row 277 (254)",null,72.867165629361509,null,18630.735991724745,null,186.30735991724745,null,null,-186.30735991724745,"LOSS",{"$f":"IF(COUNTA($F$6:$F$10)=5,(F278-F24)/F24,\"\")","v":0.84444286318074957},2,"last",null,null,null,null,null,null,null,{"$f":"IF(AND(L277=\"WIN\",L278<>\"WIN\"),SUMIF(L$24:L277,\"WIN\",K$24:K277)-SUM(W$23:W276),\"\")","v":""},{"$f":"IF(AND(L277=\"LOSS\",L278<>\"LOSS\"),SUMIF(L$24:L277,\"LOSS\",K$24:K277)-SUM(X$23:X276),\"\")","v":-374.49661235891108}]
[null,"Row 278 (255)",null,36.931205542962545,null,18444.428631807496,null,184.44428631807497,null,null,221.33314358168997,"WIN",{"$f":"IF(COUNTA($F$6:$F$10)=5,(F279-F24)/F24,\"\")","v":0.86657617753891869},1,"last",null,null,null,null,null,null,null,{"$f":"IF(AND(L278=\"WIN\",L279<>\"WIN\"),SUMIF(L$24:L278,\"WIN\",K$24:K278)-SUM(W$23:W277),\"\")","v":221.33314358169082},{"$f":"IF(AND(L278=\"LOSS\",L279<>\"LOSS\"),SUMIF(L$24:L278,\"LOSS\",K$24:K278)-SUM(X$23:X277),\"\")","v":""}]
[null,"Row 279 (256)",null,56.752763808749421,null,18665.761775389186,null,186.65761775389186,null,null,-186.65761775389186,"LOSS",{"$f":"IF(COUNTA($F$6:$F$10)=5,(F280-F24)/F24,\"\")","v":0.84791041576352943},1,"last",null,null,null,null,null,null,null,{"$f":"IF(AND(L279=\"WIN\",L280<>\"WIN\"),SUMIF(L$24:L279,\"WIN\",K$24:K279)-SUM(W$23:W278),\"\")","v":""},{"$f":"IF(AND(L279=\"LOSS\",L280<>\"LOSS\"),SUMIF(L$24:L279,\"LOSS\",K$24:K279)-SUM(X$23:X278),\"\")","v":-186.65761775389183}]
[null,"Row 280 (257)",null,15.457350401664527,null,18479.104157635295,null,184.79104157635294,null,null,221.74924989162352,"WIN",{"$f":"IF(COUNTA($F$6:$F$10)=5,(F281-F24)/F24,\"\")","v":0.87008534075269195},1,"last",null,null,null,null,null,null,null,{"$f":"IF(AND(L280=\"WIN\",L281<>\"WIN\"),SUMIF(L$24:L280,\"WIN\",K$24:K280)-SUM(W$23:W279),\"\")","v":221.74924989162173},{"$f":"IF(AND(L280=\"LOSS\",L281<>\"LOSS\"),SUMIF(L$24:L280,\"LOSS\",K$24:K280)-SUM(X$23:X279),\"\")","v":""}]
[null,"Row 281 (258)",null,{"$f":"IF(COUNTA($F$6:$F$10)=5,100*RAND(),\"\")","v":66.582312838351399},null,18700.85340752692,null,{"$f":"IF(COUNTBLANK($F$6:$F$10),\"\",F281*$F$7)","v":187.00853407526921},null,null,-187.00853407526921,{"$f":"IF(D281=\"\",\"\",IF(D281<$F$8,\"WIN\",\"LOSS\"))","v":"LOSS"},{"$f":"IF(COUNTA($F$6:$F$10)=5,(F282-F24)/F24,\"\")","v":0.85138448734516492},{"$f":"IF(L281=L280,N280+1,1)","v":1},{"$f":"IF(N281=1,IF(N282=1,\"last\",\"new\"),IF(N282=1,\"last\",\"middle\"))","v":"new"},null,null,null,null,null,null,null,{"$f":"IF(AND(L281=\"WIN\",L282<>\"WIN\"),SUMIF(L$24:L281,\"WIN\",K$24:K281)-SUM(W$23:W280),\"\")","v":""},{"$f":"IF(AND(L281=\"LOSS\",L282<>\"LOSS\"),SUMIF(L$24:L281,\"LOSS\",K$24:K281)-SUM(X$23:X280),\"\")","v":""}]
[null,"Row 282 (259)",null,76.322299518505289,null,{"$f":"IF(COUNTBLANK($F$6:$F$10),\"\",IF(D281<$F$8,(1+$F$7*$F$9)*F281-$F$10,(1-$F$7)*F281-$F$10))","v":18513.84487345165},null,185.13844873451649,null,null,{"$f":"IF(COUNTBLANK($F$6:$F$10),\"\", IF(L282=\"win\", H282*$F$9-$F$10, IF(L282=\"loss\", -H282-$F$10)))","v":-185.13844873451649},"LOSS",{"$f":"IF(COUNTA($F$6:$F$10)=5,(F283-F24)/F24,\"\")","v":0.83287064247171327},2,"middle",null,null,null,null,null,null,null,{"$f":"IF(AND(L282=\"WIN\",L283<>\"WIN\"),SUMIF(L$24:L282,\"WIN\",K$24:K282)-SUM(W$23:W281),\"\")","v":""},{"$f":"IF(AND(L282=\"LOSS\",L283<>\"LOSS\"),SUMIF(L$24:L282,\"LOSS\",K$24:K282)-SUM(X$23:X281),\"\")","v":""}]
[null,"Row 283 (260)",null,92.823217755330916,null,18328.706424717133,null,183.28706424717134,null,null,-183.28706424717134,"LOSS",{"$f":"IF(COUNTA($F$6:$F$10)=5,(F284-F24)/F24,\"\")","v":0.8145419360469961},3,"last",null,null,null,null,null,null,null,{"$f":"IF(AND(L283=\"WIN\",L284<>\"WIN\"),SUMIF(L$24:L283,\"WIN\",K$24:K283)-SUM(W$23:W282),\"\")","v":""},{"$f":"IF(AND(L283=\"LOSS\",L284<>\"LOSS\"),SUMIF(L$24:L283,\"LOSS\",K$24:K283)-SUM(X$23:X282),\"\")","v":-555.43404705695684}]
[null,"Row 284 (261)",null,30.23886715683366,null,18145.419360469961,null,181.45419360469961,null,null,217.74503232563953,"WIN",{"$f":"IF(COUNTA($F$6:$F$10)=5,(F285-F24)/F24,\"\")","v":0.8363164392795599},1,"last",null,null,null,null,null,null,null,{"$f":"IF(AND(L284=\"WIN\",L285<>\"WIN\"),SUMIF(L$24:L284,\"WIN\",K$24:K284)-SUM(W$23:W283),\"\")","v":217.74503232563802},{"$f":"IF(AND(L284=\"LOSS\",L285<>\"LOSS\"),SUMIF(L$24:L284,\"LOSS\",K$24:K284)-SUM(X$23:X283),\"\")","v":""}]
[null,"Row 285 (262)",null,91.579092425970359,null,18363.164392795599,null,183.63164392795599,null,null,-183.63164392795599,"LOSS",{"$f":"IF(COUNTA($F$6:$F$10)=5,(F286-F24)/F24,\"\")","v":0.8179532748867645},1,"last",null,null,null,null,null,null,null,{"$f":"IF(AND(L285=\"WIN\",L286<>\"WIN\"),SUMIF(L$24:L285,\"WIN\",K$24:K285)-SUM(W$23:W284),\"\")","v":""},{"$f":"IF(AND(L285=\"LOSS\",L286<>\"LOSS\"),SUMIF(L$24:L285,\"LOSS\",K$24:K285)-SUM(X$23:X284),\"\")","v":-183.63164392795625}]
[null,"Row 286 (263)",null,31.28230450612044,null,18179.532748867645,null,181.79532748867646,null,null,218.15439298641175,"WIN",{"$f":"IF(COUNTA($F$6:$F$10)=5,(F287-F24)/F24,\"\")","v":0.83976871418540577},1,"new",null,null,null,null,null,null,null,{"$f":"IF(AND(L286=\"WIN\",L287<>\"WIN\"),SUMIF(L$24:L286,\"WIN\",K$24:K286)-SUM(W$23:W285),\"\")","v":""},{"$f":"IF(AND(L286=\"LOSS\",L287<>\"LOSS\"),SUMIF(L$24:L286,\"LOSS\",K$24:K286)-SUM(X$23:X285),\"\")","v":""}]
[null,"Row 287 (264)",null,25.738467696177825,null,18397.687141854058,null,183.97687141854058,null,null,220.77224570224868,"WIN",{"$f":"IF(COUNTA($F$6:$F$10)=5,(F288-F24)/F24,\"\")","v":0.86184593875563076},2,"middle",null,null,null,null,null,null,null,{"$f":"IF(AND(L287=\"WIN\",L288<>\"WIN\"),SUMIF(L$24:L287,\"WIN\",K$24:K287)-SUM(W$23:W286),\"\")","v":""},{"$f":"IF(AND(L287=\"LOSS\",L288<>\"LOSS\"),SUMIF(L$24:L287,\"LOSS\",K$24:K287)-SUM(X$23:X286),\"\")","v":""}]
[null,"Row 288 (265)",null,28.776442534465229,null,18618.459387556308,null,186.18459387556308,null,null,223.42151265067568,"WIN",{"$f":"IF(COUNTA($F$6:$F$10)=5,(F289-F24)/F24,\"\")","v":0.88418809002069831},3,"middle",null,null,null,null,null,null,null,{"$f":"IF(AND(L288=\"WIN\",L289<>\"WIN\"),SUMIF(L$24:L288,\"WIN\",K$24:K288)-SUM(W$23:W287),\"\")","v":""},{"$f":"IF(AND(L288=\"LOSS\",L289<>\"LOSS\"),SUMIF(L$24:L288,\"LOSS\",K$24:K288)-SUM(X$23:X287),\"\")","v":""}]
[null,"Row 289 (266)",null,18.524989569445459,null,18841.880900206983,null,188.41880900206982,null,null,226.10257080248377,"WIN",{"$f":"IF(COUNTA($F$6:$F$10)=5,(F290-F24)/F24,\"\")","v":0.90679834710094653},4,"middle",null,null,null,null,null,null,null,{"$f":"IF(AND(L289=\"WIN\",L290<>\"WIN\"),SUMIF(L$24:L289,\"WIN\",K$24:K289)-SUM(W$23:W288),\"\")","v":""},{"$f":"IF(AND(L289=\"LOSS\",L290<>\"LOSS\"),SUMIF(L$24:L289,\"LOSS\",K$24:K289)-SUM(X$23:X288),\"\")","v":""}]
[null,"Row 290 (267)",null,49.031872500570003,null,19067.983471009466,null,190.67983471009467,null,null,228.81580165211361,"WIN",{"$f":"IF(COUNTA($F$6:$F$10)=5,(F291-F24)/F24,\"\")","v":0.92967992726615778},5,"last",null,null,null,null,null,null,null,{"$f":"IF(AND(L290=\"WIN\",L291<>\"WIN\"),SUMIF(L$24:L290,\"WIN\",K$24:K290)-SUM(W$23:W289),\"\")","v":1117.2665237939327},{"$f":"IF(AND(L290=\"LOSS\",L291<>\"LOSS\"),SUMIF(L$24:L290,\"LOSS\",K$24:K290)-SUM(X$23:X289),\"\")","v":""}]
[null,"Row 291 (268)",null,78.684991206366362,null,19296.799272661578,null,192.96799272661579,null,null,-192.96799272661579,"LOSS",{"$f":"IF(COUNTA($F$6:$F$10)=5,(F292-F24)/F24,\"\")","v":0.91038312799349619},1,"new",null,null,null,null,null,null,null,{"$f":"IF(AND(L291=\"WIN\",L292<>\"WIN\"),SUMIF(L$24:L291,\"WIN\",K$24:K291)-SUM(W$23:W290),\"\")","v":""},{"$f":"IF(AND(L291=\"LOSS\",L292<>\"LOSS\"),SUMIF(L$24:L291,\"LOSS\",K$24:K291)-SUM(X$23:X290),\"\")","v":""}]
[null,"Row 292 (269)",null,94.173208181296303,null,19103.831279934962,null,191.03831279934963,null,null,-191.03831279934963,"LOSS",{"$f":"IF(COUNTA($F$6:$F$10)=5,(F293-F24)/F24,\"\")","v":0.89127929671356143},2,"middle",null,null,null,null,null,null,null,{"$f":"IF(AND(L292=\"WIN\",L293<>\"WIN\"),SUMIF(L$24:L292,\"WIN\",K$24:K292)-SUM(W$23:W291),\"\")","v":""},{"$f":"IF(AND(L292=\"LOSS\",L293<>\"LOSS\"),SUMIF(L$24:L292,\"LOSS\",K$24:K292)-SUM(X$23:X291),\"\")","v":""}]
[null,"Row 293 (270)",null,68.180900562377246,null,18912.792967135614,null,189.12792967135616,null,null,-189.12792967135616,"LOSS",{"$f":"IF(COUNTA($F$6:$F$10)=5,(F294-F24)/F24,\"\")","v":0.87236650374642599},3,"middle",null,null,null,null,null,null,null,{"$f":"IF(AND(L293=\"WIN\",L294<>\"WIN\"),SUMIF(L$24:L293,\"WIN\",K$24:K293)-SUM(W$23:W292),\"\")","v":""},{"$f":"IF(AND(L293=\"LOSS\",L294<>\"LOSS\"),SUMIF(L$24:L293,\"LOSS\",K$24:K293)-SUM(X$23:X292),\"\")","v":""}]
[null,"Row 294 (271)",null,88.872721806159731,null,18723.66503746426,null,187.23665037464261,null,null,-187.23665037464261,"LOSS",{"$f":"IF(COUNTA($F$6:$F$10)=5,(F295-F24)/F24,\"\")","v":0.85364283870896174},4,"last",null,null,null,null,null,null,null,{"$f":"IF(AND(L294=\"WIN\",L295<>\"WIN\"),SUMIF(L$24:L294,\"WIN\",K$24:K294)-SUM(W$23:W293),\"\")","v":""},{"$f":"IF(AND(L294=\"LOSS\",L295<>\"LOSS\"),SUMIF(L$24:L294,\"LOSS\",K$24:K294)-SUM(X$23:X293),\"\")","v":-760.3708855719633}]
[null,"Row 295 (272)",null,5.7873242641674816,null,18536.428387089618,null,185.36428387089617,null,null,222.4371406450754,"WIN",{"$f":"IF(COUNTA($F$6:$F$10)=5,(F296-F24)/F24,\"\")","v":0.8758865527734695},1,"new",null,null,null,null,null,null,null,{"$f":"IF(AND(L295=\"WIN\",L296<>\"WIN\"),SUMIF(L$24:L295,\"WIN\",K$24:K295)-SUM(W$23:W294),\"\")","v":""},{"$f":"IF(AND(L295=\"LOSS\",L296<>\"LOSS\"),SUMIF(L$24:L295,\"LOSS\",K$24:K295)-SUM(X$23:X294),\"\")","v":""}]
[null,"Row 296 (273)",null,18.159321795581818,null,18758.865527734695,null,187.58865527734696,null,null,225.10638633281636,"WIN",{"$f":"IF(COUNTA($F$6:$F$10)=5,(F297-F24)/F24,\"\")","v":0.89839719140675112},2,"last",null,null,null,null,null,null,null,{"$f":"IF(AND(L296=\"WIN\",L297<>\"WIN\"),SUMIF(L$24:L296,\"WIN\",K$24:K296)-SUM(W$23:W295),\"\")","v":447.54352697789},{"$f":"IF(AND(L296=\"LOSS\",L297<>\"LOSS\"),SUMIF(L$24:L296,\"LOSS\",K$24:K296)-SUM(X$23:X295),\"\")","v":""}]
[null,"Row 297 (274)",null,95.252466251573011,null,18983.971914067512,null,189.83971914067513,null,null,-189.83971914067513,"LOSS",{"$f":"IF(COUNTA($F$6:$F$10)=5,(F298-F24)/F24,\"\")","v":0.87941321949268347},1,"last",null,null,null,null,null,null,null,{"$f":"IF(AND(L297=\"WIN\",L298<>\"WIN\"),SUMIF(L$24:L297,\"WIN\",K$24:K297)-SUM(W$23:W296),\"\")","v":""},{"$f":"IF(AND(L297=\"LOSS\",L298<>\"LOSS\"),SUMIF(L$24:L297,\"LOSS\",K$24:K297)-SUM(X$23:X296),\"\")","v":-189.83971914067661}]
[null,"Row 298 (275)",null,33.579094202923123,null,18794.132194926835,null,187.94132194926834,null,null,225.52958633912201,"WIN",{"$f":"IF(COUNTA($F$6:$F$10)=5,(F299-F24)/F24,\"\")","v":0.90196617812659574},1,"new",null,null,null,null,null,null,null,{"$f":"IF(AND(L298=\"WIN\",L299<>\"WIN\"),SUMIF(L$24:L298,\"WIN\",K$24:K298)-SUM(W$23:W297),\"\")","v":""},{"$f":"IF(AND(L298=\"LOSS\",L299<>\"LOSS\"),SUMIF(L$24:L298,\"LOSS\",K$24:K298)-SUM(X$23:X297),\"\")","v":""}]
[null,"Row 299 (276)",null,31.408225705028446,null,19019.661781265957,null,190.19661781265958,null,null,228.23594137519149,"WIN",{"$f":"IF(COUNTA($F$6:$F$10)=5,(F300-F24)/F24,\"\")","v":0.92478977226411485},2,"last",null,null,null,null,null,null,null,{"$f":"IF(AND(L299=\"WIN\",L300<>\"WIN\"),SUMIF(L$24:L299,\"WIN\",K$24:K299)-SUM(W$23:W298),\"\")","v":453.76552771431307},{"$f":"IF(AND(L299=\"LOSS\",L300<>\"LOSS\"),SUMIF(L$24:L299,\"LOSS\",K$24:K299)-SUM(X$23:X298),\"\")","v":""}]
[null,"Row 300 (277)",null,83.253337497215981,null,19247.897722641148,null,192.47897722641147,null,null,-192.47897722641147,"LOSS",{"$f":"IF(COUNTA($F$6:$F$10)=5,(F301-F24)/F24,\"\")","v":0.90554187454147361},1,"last",null,null,null,null,null,null,null,{"$f":"IF(AND(L300=\"WIN\",L301<>\"WIN\"),SUMIF(L$24:L300,\"WIN\",K$24:K300)-SUM(W$23:W299),\"\")","v":""},{"$f":"IF(AND(L300=\"LOSS\",L301<>\"LOSS\"),SUMIF(L$24:L300,\"LOSS\",K$24:K300)-SUM(X$23:X299),\"\")","v":-192.4789772264121}]
[null,"Row 301 (278)",null,19.729347910411466,null,19055.418745414736,null,190.55418745414735,null,null,228.66502494497681,"WIN",{"$f":"IF(COUNTA($F$6:$F$10)=5,(F302-F24)/F24,\"\")","v":0.92840837703597134},1,"new",null,null,null,null,null,null,null,{"$f":"IF(AND(L301=\"WIN\",L302<>\"WIN\"),SUMIF(L$24:L301,\"WIN\",K$24:K301)-SUM(W$23:W300),\"\")","v":""},{"$f":"IF(AND(L301=\"LOSS\",L302<>\"LOSS\"),SUMIF(L$24:L301,\"LOSS\",K$24:K301)-SUM(X$23:X300),\"\")","v":""}]
[null,"Row 302 (279)",null,24.135949100912924,null,19284.083770359714,null,192.84083770359715,null,null,231.40900524431657,"WIN",{"$f":"IF(COUNTA($F$6:$F$10)=5,(F303-F24)/F24,\"\")","v":0.95154927756040308},2,"middle",null,null,null,null,null,null,null,{"$f":"IF(AND(L302=\"WIN\",L303<>\"WIN\"),SUMIF(L$24:L302,\"WIN\",K$24:K302)-SUM(W$23:W301),\"\")","v":""},{"$f":"IF(AND(L302=\"LOSS\",L303<>\"LOSS\"),SUMIF(L$24:L302,\"LOSS\",K$24:K302)-SUM(X$23:X301),\"\")","v":""}]
[null,"Row 303 (280)",null,49.084311894487143,null,19515.492775604031,null,195.15492775604031,null,null,234.18591330724837,"WIN",{"$f":"IF(COUNTA($F$6:$F$10)=5,(F304-F24)/F24,\"\")","v":0.97496786889112808},3,"last",null,null,null,null,null,null,null,{"$f":"IF(AND(L303=\"WIN\",L304<>\"WIN\"),SUMIF(L$24:L303,\"WIN\",K$24:K303)-SUM(W$23:W302),\"\")","v":694.25994349654138},{"$f":"IF(AND(L303=\"LOSS\",L304<>\"LOSS\"),SUMIF(L$24:L303,\"LOSS\",K$24:K303)-SUM(X$23:X302),\"\")","v":""}]
[null,"Row 304 (281)",null,95.071218139237459,null,19749.678688911281,null,197.49678688911283,null,null,-197.49678688911283,"LOSS",{"$f":"IF(COUNTA($F$6:$F$10)=5,(F305-F24)/F24,\"\")","v":0.95521819020221665},1,"last",null,null,null,null,null,null,null,{"$f":"IF(AND(L304=\"WIN\",L305<>\"WIN\"),SUMIF(L$24:L304,\"WIN\",K$24:K304)-SUM(W$23:W303),\"\")","v":""},{"$f":"IF(AND(L304=\"LOSS\",L305<>\"LOSS\"),SUMIF(L$24:L304,\"LOSS\",K$24:K304)-SUM(X$23:X303),\"\")","v":-197.49678688911445}]
[null,"Row 305 (282)",null,5.2566497355146735,null,19552.181902022166,null,195.52181902022167,null,null,234.62618282426598,"WIN",{"$f":"IF(COUNTA($F$6:$F$10)=5,(F306-F24)/F24,\"\")","v":0.97868080848464345},1,"new",null,null,null,null,null,null,null,{"$f":"IF(AND(L305=\"WIN\",L306<>\"WIN\"),SUMIF(L$24:L305,\"WIN\",K$24:K305)-SUM(W$23:W304),\"\")","v":""},{"$f":"IF(AND(L305=\"LOSS\",L306<>\"LOSS\"),SUMIF(L$24:L305,\"LOSS\",K$24:K305)-SUM(X$23:X304),\"\")","v":""}]
[null,"Row 306 (283)",null,47.631222468789204,null,19786.808084846434,null,197.86808084846436,null,null,237.44169701815721,"WIN",{"$f":"IF(COUNTA($F$6:$F$10)=5,(F307-F24)/F24,\"\")","v":1.0024249781864594},2,"last",null,null,null,null,null,null,null,{"$f":"IF(AND(L306=\"WIN\",L307<>\"WIN\"),SUMIF(L$24:L306,\"WIN\",K$24:K306)-SUM(W$23:W305),\"\")","v":472.06787984242328},{"$f":"IF(AND(L306=\"LOSS\",L307<>\"LOSS\"),SUMIF(L$24:L306,\"LOSS\",K$24:K306)-SUM(X$23:X305),\"\")","v":""}]
[null,"Row 307 (284)",null,88.604209402828999,null,20024.249781864593,null,200.24249781864594,null,null,-200.24249781864594,"LOSS",{"$f":"IF(COUNTA($F$6:$F$10)=5,(F308-F24)/F24,\"\")","v":0.98240072840459469},1,"new",null,null,null,null,null,null,null,{"$f":"IF(AND(L307=\"WIN\",L308<>\"WIN\"),SUMIF(L$24:L307,\"WIN\",K$24:K307)-SUM(W$23:W306),\"\")","v":""},{"$f":"IF(AND(L307=\"LOSS\",L308<>\"LOSS\"),SUMIF(L$24:L307,\"LOSS\",K$24:K307)-SUM(X$23:X306),\"\")","v":""}]
[null,"Row 308 (285)",null,98.929943347694646,null,19824.007284045947,null,198.24007284045948,null,null,-198.24007284045948,"LOSS",{"$f":"IF(COUNTA($F$6:$F$10)=5,(F309-F24)/F24,\"\")","v":0.9625767211205486},2,"last",null,null,null,null,null,null,null,{"$f":"IF(AND(L308=\"WIN\",L309<>\"WIN\"),SUMIF(L$24:L308,\"WIN\",K$24:K308)-SUM(W$23:W307),\"\")","v":""},{"$f":"IF(AND(L308=\"LOSS\",L309<>\"LOSS\"),SUMIF(L$24:L308,\"LOSS\",K$24:K308)-SUM(X$23:X307),\"\")","v":-398.4825706591073}]
[null,"Row 309 (286)",null,33.868571200494188,null,19625.767211205486,null,196.25767211205488,null,null,235.50920653446585,"WIN",{"$f":"IF(COUNTA($F$6:$F$10)=5,(F310-F24)/F24,\"\")","v":0.98612764177399514},1,"new",null,null,null,null,null,null,null,{"$f":"IF(AND(L309=\"WIN\",L310<>\"WIN\"),SUMIF(L$24:L309,\"WIN\",K$24:K309)-SUM(W$23:W308),\"\")","v":""},{"$f":"IF(AND(L309=\"LOSS\",L310<>\"LOSS\"),SUMIF(L$24:L309,\"LOSS\",K$24:K309)-SUM(X$23:X308),\"\")","v":""}]
[null,"Row 310 (287)",null,44.390355606044672,null,19861.276417739951,null,198.61276417739953,null,null,238.33531701287941,"WIN",{"$f":"IF(COUNTA($F$6:$F$10)=5,(F311-F24)/F24,\"\")","v":1.0099611734752831},2,"middle",null,null,null,null,null,null,null,{"$f":"IF(AND(L310=\"WIN\",L311<>\"WIN\"),SUMIF(L$24:L310,\"WIN\",K$24:K310)-SUM(W$23:W309),\"\")","v":""},{"$f":"IF(AND(L310=\"LOSS\",L311<>\"LOSS\"),SUMIF(L$24:L310,\"LOSS\",K$24:K310)-SUM(X$23:X309),\"\")","v":""}]
[null,"Row 311 (288)",null,2.9921005838118742,null,20099.611734752831,null,200.9961173475283,null,null,241.19534081703395,"WIN",{"$f":"IF(COUNTA($F$6:$F$10)=5,(F312-F24)/F24,\"\")","v":1.0340807075569864},3,"last",null,null,null,null,null,null,null,{"$f":"IF(AND(L311=\"WIN\",L312<>\"WIN\"),SUMIF(L$24:L311,\"WIN\",K$24:K311)-SUM(W$23:W310),\"\")","v":715.03986436437845},{"$f":"IF(AND(L311=\"LOSS\",L312<>\"LOSS\"),SUMIF(L$24:L311,\"LOSS\",K$24:K311)-SUM(X$23:X310),\"\")","v":""}]
[null,"Row 312 (289)",null,92.490977527450255,null,20340.807075569865,null,203.40807075569865,null,null,-203.40807075569865,"LOSS",{"$f":"IF(COUNTA($F$6:$F$10)=5,(F313-F24)/F24,\"\")","v":1.0137399004814165},1,"new",null,null,null,null,null,null,null,{"$f":"IF(AND(L312=\"WIN\",L313<>\"WIN\"),SUMIF(L$24:L312,\"WIN\",K$24:K312)-SUM(W$23:W311),\"\")","v":""},{"$f":"IF(AND(L312=\"LOSS\",L313<>\"LOSS\"),SUMIF(L$24:L312,\"LOSS\",K$24:K312)-SUM(X$23:X311),\"\")","v":""}]
[null,"Row 313 (290)",null,85.274630002593156,null,20137.399004814164,null,201.37399004814165,null,null,-201.37399004814165,"LOSS",{"$f":"IF(COUNTA($F$6:$F$10)=5,(F314-F24)/F24,\"\")","v":0.99360250147660223},2,"middle",null,null,null,null,null,null,null,{"$f":"IF(AND(L313=\"WIN\",L314<>\"WIN\"),SUMIF(L$24:L313,\"WIN\",K$24:K313)-SUM(W$23:W312),\"\")","v":""},{"$f":"IF(AND(L313=\"LOSS\",L314<>\"LOSS\"),SUMIF(L$24:L313,\"LOSS\",K$24:K313)-SUM(X$23:X312),\"\")","v":""}]
[null,"Row 314 (291)",null,84.532646145465236,null,19936.025014766023,null,199.36025014766022,null,null,-199.36025014766022,"LOSS",{"$f":"IF(COUNTA($F$6:$F$10)=5,(F315-F24)/F24,\"\")","v":0.97366647646183624},3,"middle",null,null,null,null,null,null,null,{"$f":"IF(AND(L314=\"WIN\",L315<>\"WIN\"),SUMIF(L$24:L314,\"WIN\",K$24:K314)-SUM(W$23:W313),\"\")","v":""},{"$f":"IF(AND(L314=\"LOSS\",L315<>\"LOSS\"),SUMIF(L$24:L314,\"LOSS\",K$24:K314)-SUM(X$23:X313),\"\")","v":""}]
[null,"Row 315 (292)",null,71.524224646589857,null,19736.664764618363,null,197.36664764618362,null,null,-197.36664764618362,"LOSS",{"$f":"IF(COUNTA($F$6:$F$10)=5,(F316-F24)/F24,\"\")","v":0.95392981169721791},4,"last",null,null,null,null,null,null,null,{"$f":"IF(AND(L315=\"WIN\",L316<>\"WIN\"),SUMIF(L$24:L315,\"WIN\",K$24:K315)-SUM(W$23:W314),\"\")","v":""},{"$f":"IF(AND(L315=\"LOSS\",L316<>\"LOSS\"),SUMIF(L$24:L315,\"LOSS\",K$24:K315)-SUM(X$23:X314),\"\")","v":-801.50895859768571}]
[null,"Row 316 (293)",null,53.274765571200177,null,19539.298116972179,null,195.39298116972179,null,null,234.47157740366615,"WIN",{"$f":"IF(COUNTA($F$6:$F$10)=5,(F317-F24)/F24,\"\")","v":0.97737696943758456},1,"last",null,null,null,null,null,null,null,{"$f":"IF(AND(L316=\"WIN\",L317<>\"WIN\"),SUMIF(L$24:L316,\"WIN\",K$24:K316)-SUM(W$23:W315),\"\")","v":234.47157740366674},{"$f":"IF(AND(L316=\"LOSS\",L317<>\"LOSS\"),SUMIF(L$24:L316,\"LOSS\",K$24:K316)-SUM(X$23:X315),\"\")","v":""}]
[null,"Row 317 (294)",null,76.926335551161458,null,19773.769694375846,null,197.73769694375846,null,null,-197.73769694375846,"LOSS",{"$f":"IF(COUNTA($F$6:$F$10)=5,(F318-F24)/F24,\"\")","v":0.95760319974320884},1,"new",null,null,null,null,null,null,null,{"$f":"IF(AND(L317=\"WIN\",L318<>\"WIN\"),SUMIF(L$24:L317,\"WIN\",K$24:K317)-SUM(W$23:W316),\"\")","v":""},{"$f":"IF(AND(L317=\"LOSS\",L318<>\"LOSS\"),SUMIF(L$24:L317,\"LOSS\",K$24:K317)-SUM(X$23:X316),\"\")","v":""}]
[null,"Row 318 (295)",null,70.849598658077383,null,19576.031997432088,null,195.76031997432088,null,null,-195.76031997432088,"LOSS",{"$f":"IF(COUNTA($F$6:$F$10)=5,(F319-F24)/F24,\"\")","v":0.93802716774577677},2,"last",null,null,null,null,null,null,null,{"$f":"IF(AND(L318=\"WIN\",L319<>\"WIN\"),SUMIF(L$24:L318,\"WIN\",K$24:K318)-SUM(W$23:W317),\"\")","v":""},{"$f":"IF(AND(L318=\"LOSS\",L319<>\"LOSS\"),SUMIF(L$24:L318,\"LOSS\",K$24:K318)-SUM(X$23:X317),\"\")","v":-393.49801691807806}]
[null,"Row 319 (296)",null,50.631604476660229,null,19380.271677457768,null,193.80271677457768,null,null,232.56326012949319,"WIN",{"$f":"IF(COUNTA($F$6:$F$10)=5,(F320-F24)/F24,\"\")","v":0.96128349375872602},1,"last",null,null,null,null,null,null,null,{"$f":"IF(AND(L319=\"WIN\",L320<>\"WIN\"),SUMIF(L$24:L319,\"WIN\",K$24:K319)-SUM(W$23:W318),\"\")","v":232.56326012949285},{"$f":"IF(AND(L319=\"LOSS\",L320<>\"LOSS\"),SUMIF(L$24:L319,\"LOSS\",K$24:K319)-SUM(X$23:X318),\"\")","v":""}]
[null,"Row 320 (297)",null,70.639341625825566,null,19612.83493758726,null,196.1283493758726,null,null,-196.1283493758726,"LOSS",{"$f":"IF(COUNTA($F$6:$F$10)=5,(F321-F24)/F24,\"\")","v":0.94167065882113898},1,"last",null,null,null,null,null,null,null,{"$f":"IF(AND(L320=\"WIN\",L321<>\"WIN\"),SUMIF(L$24:L320,\"WIN\",K$24:K320)-SUM(W$23:W319),\"\")","v":""},{"$f":"IF(AND(L320=\"LOSS\",L321<>\"LOSS\"),SUMIF(L$24:L320,\"LOSS\",K$24:K320)-SUM(X$23:X319),\"\")","v":-196.12834937587104}]
[null,"Row 321 (298)",null,53.615570765535871,null,19416.706588211389,null,194.16706588211389,null,null,233.00047905853665,"WIN",{"$f":"IF(COUNTA($F$6:$F$10)=5,(F322-F24)/F24,\"\")","v":0.9649707067269927},1,"new",null,null,null,null,null,null,null,{"$f":"IF(AND(L321=\"WIN\",L322<>\"WIN\"),SUMIF(L$24:L321,\"WIN\",K$24:K321)-SUM(W$23:W320),\"\")","v":""},{"$f":"IF(AND(L321=\"LOSS\",L322<>\"LOSS\"),SUMIF(L$24:L321,\"LOSS\",K$24:K321)-SUM(X$23:X320),\"\")","v":""}]
[null,"Row 322 (299)",null,31.130787377170765,null,19649.707067269926,null,196.49707067269927,null,null,235.7964848072391,"WIN",{"$f":"IF(COUNTA($F$6:$F$10)=5,(F323-F24)/F24,\"\")","v":0.98855035520771672},2,"middle",null,null,null,null,null,null,null,{"$f":"IF(AND(L322=\"WIN\",L323<>\"WIN\"),SUMIF(L$24:L322,\"WIN\",K$24:K322)-SUM(W$23:W321),\"\")","v":""},{"$f":"IF(AND(L322=\"LOSS\",L323<>\"LOSS\"),SUMIF(L$24:L322,\"LOSS\",K$24:K322)-SUM(X$23:X321),\"\")","v":""}]
[null,"Row 323 (300)",null,29.002395644314127,null,19885.503552077167,null,198.85503552077168,null,null,238.62604262492601,"WIN",{"$f":"IF(COUNTA($F$6:$F$10)=5,(F324-F24)/F24,\"\")","v":1.0124129594702092},3,"middle",null,null,null,null,null,null,null,{"$f":"IF(AND(L323=\"WIN\",L324<>\"WIN\"),SUMIF(L$24:L323,\"WIN\",K$24:K323)-SUM(W$23:W322),\"\")","v":""},{"$f":"IF(AND(L323=\"LOSS\",L324<>\"LOSS\"),SUMIF(L$24:L323,\"LOSS\",K$24:K323)-SUM(X$23:X322),\"\")","v":""}]
[null,"Row 324 (301)",null,35.343597578136375,null,20124.129594702092,null,201.24129594702092,null,null,241.48955513642508,"WIN",{"$f":"IF(COUNTA($F$6:$F$10)=5,(F325-F24)/F24,\"\")","v":1.0365619149838516},4,"last",null,null,null,null,null,null,null,{"$f":"IF(AND(L324=\"WIN\",L325<>\"WIN\"),SUMIF(L$24:L324,\"WIN\",K$24:K324)-SUM(W$23:W323),\"\")","v":948.91256162712671},{"$f":"IF(AND(L324=\"LOSS\",L325<>\"LOSS\"),SUMIF(L$24:L324,\"LOSS\",K$24:K324)-SUM(X$23:X323),\"\")","v":""}]
[null,"Row 325 (302)",null,97.932271142192889,null,20365.619149838516,null,203.65619149838517,null,null,-203.65619149838517,"LOSS",{"$f":"IF(COUNTA($F$6:$F$10)=5,(F326-F24)/F24,\"\")","v":1.0161962958340129},1,"new",null,null,null,null,null,null,null,{"$f":"IF(AND(L325=\"WIN\",L326<>\"WIN\"),SUMIF(L$24:L325,\"WIN\",K$24:K325)-SUM(W$23:W324),\"\")","v":""},{"$f":"IF(AND(L325=\"LOSS\",L326<>\"LOSS\"),SUMIF(L$24:L325,\"LOSS\",K$24:K325)-SUM(X$23:X324),\"\")","v":""}]
[null,"Row 326 (303)",null,57.358912616998602,null,20161.962958340129,null,201.61962958340129,null,null,-201.61962958340129,"LOSS",{"$f":"IF(COUNTA($F$6:$F$10)=5,(F327-F24)/F24,\"\")","v":0.99603433287567278},2,"last",null,null,null,null,null,null,null,{"$f":"IF(AND(L326=\"WIN\",L327<>\"WIN\"),SUMIF(L$24:L326,\"WIN\",K$24:K326)-SUM(W$23:W325),\"\")","v":""},{"$f":"IF(AND(L326=\"LOSS\",L327<>\"LOSS\"),SUMIF(L$24:L326,\"LOSS\",K$24:K326)-SUM(X$23:X325),\"\")","v":-405.27582108178831}]
[null,"Row 327 (304)",null,22.783745602495799,null,19960.343328756728,null,199.60343328756727,null,null,239.52411994508071,"WIN",{"$f":"IF(COUNTA($F$6:$F$10)=5,(F328-F24)/F24,\"\")","v":1.0199867448701807},1,"new",null,null,null,null,null,null,null,{"$f":"IF(AND(L327=\"WIN\",L328<>\"WIN\"),SUMIF(L$24:L327,\"WIN\",K$24:K327)-SUM(W$23:W326),\"\")","v":""},{"$f":"IF(AND(L327=\"LOSS\",L328<>\"LOSS\"),SUMIF(L$24:L327,\"LOSS\",K$24:K327)-SUM(X$23:X326),\"\")","v":""}]
[null,"Row 328 (305)",null,41.84619899724418,null,20199.867448701807,null,201.99867448701806,null,null,242.39840938442165,"WIN",{"$f":"IF(COUNTA($F$6:$F$10)=5,(F329-F24)/F24,\"\")","v":1.044226585808623},2,"middle",null,null,null,null,null,null,null,{"$f":"IF(AND(L328=\"WIN\",L329<>\"WIN\"),SUMIF(L$24:L328,\"WIN\",K$24:K328)-SUM(W$23:W327),\"\")","v":""},{"$f":"IF(AND(L328=\"LOSS\",L329<>\"LOSS\"),SUMIF(L$24:L328,\"LOSS\",K$24:K328)-SUM(X$23:X327),\"\")","v":""}]
[null,"Row 329 (306)",null,44.681604507381955,null,20442.26585808623,null,204.4226585808623,null,null,245.30719029703477,"WIN",{"$f":"IF(COUNTA($F$6:$F$10)=5,(F330-F24)/F24,\"\")","v":1.0687573048383263},3,"last",null,null,null,null,null,null,null,{"$f":"IF(AND(L329=\"WIN\",L330<>\"WIN\"),SUMIF(L$24:L329,\"WIN\",K$24:K329)-SUM(W$23:W328),\"\")","v":727.22971962653537},{"$f":"IF(AND(L329=\"LOSS\",L330<>\"LOSS\"),SUMIF(L$24:L329,\"LOSS\",K$24:K329)-SUM(X$23:X328),\"\")","v":""}]
[null,"Row 330 (307)",null,95.789900726175716,null,20687.573048383263,null,206.87573048383263,null,null,-206.87573048383263,"LOSS",{"$f":"IF(COUNTA($F$6:$F$10)=5,(F331-F24)/F24,\"\")","v":1.048069731789943},1,"last",null,null,null,null,null,null,null,{"$f":"IF(AND(L330=\"WIN\",L331<>\"WIN\"),SUMIF(L$24:L330,\"WIN\",K$24:K330)-SUM(W$23:W329),\"\")","v":""},{"$f":"IF(AND(L330=\"LOSS\",L331<>\"LOSS\"),SUMIF(L$24:L330,\"LOSS\",K$24:K330)-SUM(X$23:X329),\"\")","v":-206.87573048383274}]
[null,"Row 331 (308)",null,1.4565132706083062,null,20480.69731789943,null,204.8069731789943,null,null,245.76836781479315,"WIN",{"$f":"IF(COUNTA($F$6:$F$10)=5,(F332-F24)/F24,\"\")","v":1.0726465685714226},1,"last",null,null,null,null,null,null,null,{"$f":"IF(AND(L331=\"WIN\",L332<>\"WIN\"),SUMIF(L$24:L331,\"WIN\",K$24:K331)-SUM(W$23:W330),\"\")","v":245.76836781479142},{"$f":"IF(AND(L331=\"LOSS\",L332<>\"LOSS\"),SUMIF(L$24:L331,\"LOSS\",K$24:K331)-SUM(X$23:X330),\"\")","v":""}]
[null,"Row 332 (309)",null,72.314818795576159,null,20726.465685714225,null,207.26465685714226,null,null,-207.26465685714226,"LOSS",{"$f":"IF(COUNTA($F$6:$F$10)=5,(F333-F24)/F24,\"\")","v":1.0519201028857081},1,"last",null,null,null,null,null,null,null,{"$f":"IF(AND(L332=\"WIN\",L333<>\"WIN\"),SUMIF(L$24:L332,\"WIN\",K$24:K332)-SUM(W$23:W331),\"\")","v":""},{"$f":"IF(AND(L332=\"LOSS\",L333<>\"LOSS\"),SUMIF(L$24:L332,\"LOSS\",K$24:K332)-SUM(X$23:X331),\"\")","v":-207.26465685714356}]
[null,"Row 333 (310)",null,26.009450713964643,null,20519.201028857082,null,205.19201028857083,null,null,246.23041234628499,"WIN",{"$f":"IF(COUNTA($F$6:$F$10)=5,(F334-F24)/F24,\"\")","v":1.0765431441203368},1,"new",null,null,null,null,null,null,null,{"$f":"IF(AND(L333=\"WIN\",L334<>\"WIN\"),SUMIF(L$24:L333,\"WIN\",K$24:K333)-SUM(W$23:W332),\"\")","v":""},{"$f":"IF(AND(L333=\"LOSS\",L334<>\"LOSS\"),SUMIF(L$24:L333,\"LOSS\",K$24:K333)-SUM(X$23:X332),\"\")","v":""}]
[null,"Row 334 (311)",null,9.7508995143544492,null,20765.431441203367,null,207.65431441203367,null,null,249.18517729444039,"WIN",{"$f":"IF(COUNTA($F$6:$F$10)=5,(F335-F24)/F24,\"\")","v":1.1014616618497806},2,"last",null,null,null,null,null,null,null,{"$f":"IF(AND(L334=\"WIN\",L335<>\"WIN\"),SUMIF(L$24:L334,\"WIN\",K$24:K334)-SUM(W$23:W333),\"\")","v":495.41558964072465},{"$f":"IF(AND(L334=\"LOSS\",L335<>\"LOSS\"),SUMIF(L$24:L334,\"LOSS\",K$24:K334)-SUM(X$23:X333),\"\")","v":""}]
[null,"Row 335 (312)",null,60.185794924954784,null,21014.616618497806,null,210.14616618497806,null,null,-210.14616618497806,"LOSS",{"$f":"IF(COUNTA($F$6:$F$10)=5,(F336-F24)/F24,\"\")","v":1.0804470452312827},1,"last",null,null,null,null,null,null,null,{"$f":"IF(AND(L335=\"WIN\",L336<>\"WIN\"),SUMIF(L$24:L335,\"WIN\",K$24:K335)-SUM(W$23:W334),\"\")","v":""},{"$f":"IF(AND(L335=\"LOSS\",L336<>\"LOSS\"),SUMIF(L$24:L335,\"LOSS\",K$24:K335)-SUM(X$23:X334),\"\")","v":-210.14616618497894}]
[null,"Row 336 (313)",null,20.896185251877107,null,20804.470452312828,null,208.04470452312827,null,null,249.65364542775393,"WIN",{"$f":"IF(COUNTA($F$6:$F$10)=5,(F337-F24)/F24,\"\")","v":1.1054124097740583},1,"new",null,null,null,null,null,null,null,{"$f":"IF(AND(L336=\"WIN\",L337<>\"WIN\"),SUMIF(L$24:L336,\"WIN\",K$24:K336)-SUM(W$23:W335),\"\")","v":""},{"$f":"IF(AND(L336=\"LOSS\",L337<>\"LOSS\"),SUMIF(L$24:L336,\"LOSS\",K$24:K336)-SUM(X$23:X335),\"\")","v":""}]
[null,"Row 337 (314)",null,2.9686978203993797,null,21054.124097740583,null,210.54124097740583,null,null,252.649489172887,"WIN",{"$f":"IF(COUNTA($F$6:$F$10)=5,(F338-F24)/F24,\"\")","v":1.130677358691347},2,"middle",null,null,null,null,null,null,null,{"$f":"IF(AND(L337=\"WIN\",L338<>\"WIN\"),SUMIF(L$24:L337,\"WIN\",K$24:K337)-SUM(W$23:W336),\"\")","v":""},{"$f":"IF(AND(L337=\"LOSS\",L338<>\"LOSS\"),SUMIF(L$24:L337,\"LOSS\",K$24:K337)-SUM(X$23:X336),\"\")","v":""}]
[null,"Row 338 (315)",null,33.842374884513561,null,21306.77358691347,null,213.06773586913471,null,null,255.68128304296164,"WIN",{"$f":"IF(COUNTA($F$6:$F$10)=5,(F339-F24)/F24,\"\")","v":1.1562454869956433},3,"last",null,null,null,null,null,null,null,{"$f":"IF(AND(L338=\"WIN\",L339<>\"WIN\"),SUMIF(L$24:L338,\"WIN\",K$24:K338)-SUM(W$23:W337),\"\")","v":757.98441764360541},{"$f":"IF(AND(L338=\"LOSS\",L339<>\"LOSS\"),SUMIF(L$24:L338,\"LOSS\",K$24:K338)-SUM(X$23:X337),\"\")","v":""}]
[null,"Row 339 (316)",null,63.862497813331878,null,21562.454869956433,null,215.62454869956434,null,null,-215.62454869956434,"LOSS",{"$f":"IF(COUNTA($F$6:$F$10)=5,(F340-F24)/F24,\"\")","v":1.1346830321256869},1,"new",null,null,null,null,null,null,null,{"$f":"IF(AND(L339=\"WIN\",L340<>\"WIN\"),SUMIF(L$24:L339,\"WIN\",K$24:K339)-SUM(W$23:W338),\"\")","v":""},{"$f":"IF(AND(L339=\"LOSS\",L340<>\"LOSS\"),SUMIF(L$24:L339,\"LOSS\",K$24:K339)-SUM(X$23:X338),\"\")","v":""}]
[null,"Row 340 (317)",null,66.151027903679932,null,21346.830321256868,null,213.46830321256869,null,null,-213.46830321256869,"LOSS",{"$f":"IF(COUNTA($F$6:$F$10)=5,(F341-F24)/F24,\"\")","v":1.1133362018044299},2,"last",null,null,null,null,null,null,null,{"$f":"IF(AND(L340=\"WIN\",L341<>\"WIN\"),SUMIF(L$24:L340,\"WIN\",K$24:K340)-SUM(W$23:W339),\"\")","v":""},{"$f":"IF(AND(L340=\"LOSS\",L341<>\"LOSS\"),SUMIF(L$24:L340,\"LOSS\",K$24:K340)-SUM(X$23:X339),\"\")","v":-429.09285191213348}]
[null,"Row 341 (318)",null,42.041399840123425,null,21133.362018044299,null,211.33362018044301,null,null,253.6003442165316,"WIN",{"$f":"IF(COUNTA($F$6:$F$10)=5,(F342-F24)/F24,\"\")","v":1.1386962362260831},1,"new",null,null,null,null,null,null,null,{"$f":"IF(AND(L341=\"WIN\",L342<>\"WIN\"),SUMIF(L$24:L341,\"WIN\",K$24:K341)-SUM(W$23:W340),\"\")","v":""},{"$f":"IF(AND(L341=\"LOSS\",L342<>\"LOSS\"),SUMIF(L$24:L341,\"LOSS\",K$24:K341)-SUM(X$23:X340),\"\")","v":""}]
[null,"Row 342 (319)",null,30.583218075673557,null,21386.962362260831,null,213.86962362260832,null,null,256.64354834712998,"WIN",{"$f":"IF(COUNTA($F$6:$F$10)=5,(F343-F24)/F24,\"\")","v":1.1643605910607959},2,"middle",null,null,null,null,null,null,null,{"$f":"IF(AND(L342=\"WIN\",L343<>\"WIN\"),SUMIF(L$24:L342,\"WIN\",K$24:K342)-SUM(W$23:W341),\"\")","v":""},{"$f":"IF(AND(L342=\"LOSS\",L343<>\"LOSS\"),SUMIF(L$24:L342,\"LOSS\",K$24:K342)-SUM(X$23:X341),\"\")","v":""}]
[null,"Row 343 (320)",null,38.499499746476509,null,21643.605910607959,null,216.4360591060796,null,null,259.72327092729552,"WIN",{"$f":"IF(COUNTA($F$6:$F$10)=5,(F344-F24)/F24,\"\")","v":1.1903329181535254},3,"middle",null,null,null,null,null,null,null,{"$f":"IF(AND(L343=\"WIN\",L344<>\"WIN\"),SUMIF(L$24:L343,\"WIN\",K$24:K343)-SUM(W$23:W342),\"\")","v":""},{"$f":"IF(AND(L343=\"LOSS\",L344<>\"LOSS\"),SUMIF(L$24:L343,\"LOSS\",K$24:K343)-SUM(X$23:X342),\"\")","v":""}]
[null,"Row 344 (321)",null,25.605809544405421,null,21903.329181535253,null,219.03329181535253,null,null,262.83995017842301,"WIN",{"$f":"IF(COUNTA($F$6:$F$10)=5,(F345-F24)/F24,\"\")","v":1.2166169131713676},4,"middle",null,null,null,null,null,null,null,{"$f":"IF(AND(L344=\"WIN\",L345<>\"WIN\"),SUMIF(L$24:L344,\"WIN\",K$24:K344)-SUM(W$23:W343),\"\")","v":""},{"$f":"IF(AND(L344=\"LOSS\",L345<>\"LOSS\"),SUMIF(L$24:L344,\"LOSS\",K$24:K344)-SUM(X$23:X343),\"\")","v":""}]
[null,"Row 345 (322)",null,{"$f":"IF(COUNTA($F$6:$F$10)=5,100*RAND(),\"\")","v":33.461335942548601},null,22166.169131713676,null,{"$f":"IF(COUNTBLANK($F$6:$F$10),\"\",F345*$F$7)","v":221.66169131713676},null,null,265.99402958056407,{"$f":"IF(D345=\"\",\"\",IF(D345<$F$8,\"WIN\",\"LOSS\"))","v":"WIN"},{"$f":"IF(COUNTA($F$6:$F$10)=5,(F346-F24)/F24,\"\")","v":1.2432163161294241},{"$f":"IF(L345=L344,N344+1,1)","v":5},{"$f":"IF(N345=1,IF(N346=1,\"last\",\"new\"),IF(N346=1,\"last\",\"middle\"))","v":"middle"},null,null,null,null,null,null,null,{"$f":"IF(AND(L345=\"WIN\",L346<>\"WIN\"),SUMIF(L$24:L345,\"WIN\",K$24:K345)-SUM(W$23:W344),\"\")","v":""},{"$f":"IF(AND(L345=\"LOSS\",L346<>\"LOSS\"),SUMIF(L$24:L345,\"LOSS\",K$24:K345)-SUM(X$23:X344),\"\")","v":""}]
[null,"Row 346 (323)",null,16.027509268505924,null,{"$f":"IF(COUNTBLANK($F$6:$F$10),\"\",IF(D345<$F$8,(1+$F$7*$F$9)*F345-$F$10,(1-$F$7)*F345-$F$10))","v":22432.16316129424},null,224.32163161294241,null,null,{"$f":"IF(COUNTBLANK($F$6:$F$10),\"\", IF(L346=\"win\", H346*$F$9-$F$10, IF(L346=\"loss\", -H346-$F$10)))","v":269.18595793553089},"WIN",{"$f":"IF(COUNTA($F$6:$F$10)=5,(F347-F24)/F24,\"\")","v":1.270134911922977},6,"middle",null,null,null,null,null,null,null,{"$f":"IF(AND(L346=\"WIN\",L347<>\"WIN\"),SUMIF(L$24:L346,\"WIN\",K$24:K346)-SUM(W$23:W345),\"\")","v":""},{"$f":"IF(AND(L346=\"LOSS\",L347<>\"LOSS\"),SUMIF(L$24:L346,\"LOSS\",K$24:K346)-SUM(X$23:X345),\"\")","v":""}]
[null,"Row 347 (324)",null,6.6475780777983111,null,22701.34911922977,null,227.01349119229769,null,null,272.41618943075724,"WIN",{"$f":"IF(COUNTA($F$6:$F$10)=5,(F348-F24)/F24,\"\")","v":1.2973765308660528},7,"last",null,null,null,null,null,null,null,{"$f":"IF(AND(L347=\"WIN\",L348<>\"WIN\"),SUMIF(L$24:L347,\"WIN\",K$24:K347)-SUM(W$23:W346),\"\")","v":1840.4032906162247},{"$f":"IF(AND(L347=\"LOSS\",L348<>\"LOSS\"),SUMIF(L$24:L347,\"LOSS\",K$24:K347)-SUM(X$23:X346),\"\")","v":""}]
[null,"Row 348 (325)",null,67.324676674424538,null,22973.765308660528,null,229.73765308660529,null,null,-229.73765308660529,"LOSS",{"$f":"IF(COUNTA($F$6:$F$10)=5,(F349-F24)/F24,\"\")","v":1.2744027655573922},1,"last",null,null,null,null,null,null,null,{"$f":"IF(AND(L348=\"WIN\",L349<>\"WIN\"),SUMIF(L$24:L348,\"WIN\",K$24:K348)-SUM(W$23:W347),\"\")","v":""},{"$f":"IF(AND(L348=\"LOSS\",L349<>\"LOSS\"),SUMIF(L$24:L348,\"LOSS\",K$24:K348)-SUM(X$23:X347),\"\")","v":-229.73765308660586}]
[null,"Row 349 (326)",null,8.3510772597653276,null,22744.027655573922,null,227.44027655573922,null,null,272.92833186688705,"WIN",{"$f":"IF(COUNTA($F$6:$F$10)=5,(F350-F24)/F24,\"\")","v":1.3016955987440808},1,"last",null,null,null,null,null,null,null,{"$f":"IF(AND(L349=\"WIN\",L350<>\"WIN\"),SUMIF(L$24:L349,\"WIN\",K$24:K349)-SUM(W$23:W348),\"\")","v":272.92833186688949},{"$f":"IF(AND(L349=\"LOSS\",L350<>\"LOSS\"),SUMIF(L$24:L349,\"LOSS\",K$24:K349)-SUM(X$23:X348),\"\")","v":""}]
[null,"Row 350 (327)",null,86.340107740845653,null,23016.955987440808,null,230.16955987440809,null,null,-230.16955987440809,"LOSS",{"$f":"IF(COUNTA($F$6:$F$10)=5,(F351-F24)/F24,\"\")","v":1.2786786427566399},1,"last",null,null,null,null,null,null,null,{"$f":"IF(AND(L350=\"WIN\",L351<>\"WIN\"),SUMIF(L$24:L350,\"WIN\",K$24:K350)-SUM(W$23:W349),\"\")","v":""},{"$f":"IF(AND(L350=\"LOSS\",L351<>\"LOSS\"),SUMIF(L$24:L350,\"LOSS\",K$24:K350)-SUM(X$23:X349),\"\")","v":-230.16955987440815}]
[null,"Row 351 (328)",null,3.5307073052851079,null,22786.7864275664,null,227.867864275664,null,null,273.44143713079677,"WIN",{"$f":"IF(COUNTA($F$6:$F$10)=5,(F352-F24)/F24,\"\")","v":1.3060227864697198},1,"new",null,null,null,null,null,null,null,{"$f":"IF(AND(L351=\"WIN\",L352<>\"WIN\"),SUMIF(L$24:L351,\"WIN\",K$24:K351)-SUM(W$23:W350),\"\")","v":""},{"$f":"IF(AND(L351=\"LOSS\",L352<>\"LOSS\"),SUMIF(L$24:L351,\"LOSS\",K$24:K351)-SUM(X$23:X350),\"\")","v":""}]
[null,"Row 352 (329)",null,1.8622380537781424,null,23060.227864697197,null,230.60227864697197,null,null,276.72273437636636,"WIN",{"$f":"IF(COUNTA($F$6:$F$10)=5,(F353-F24)/F24,\"\")","v":1.3336950599073563},2,"last",null,null,null,null,null,null,null,{"$f":"IF(AND(L352=\"WIN\",L353<>\"WIN\"),SUMIF(L$24:L352,\"WIN\",K$24:K352)-SUM(W$23:W351),\"\")","v":550.16417150716006},{"$f":"IF(AND(L352=\"LOSS\",L353<>\"LOSS\"),SUMIF(L$24:L352,\"LOSS\",K$24:K352)-SUM(X$23:X351),\"\")","v":""}]
[null,"Row 353 (330)",null,65.565010848722338,null,23336.950599073563,null,233.36950599073563,null,null,-233.36950599073563,"LOSS",{"$f":"IF(COUNTA($F$6:$F$10)=5,(F354-F24)/F24,\"\")","v":1.3103581093082826},1,"last",null,null,null,null,null,null,null,{"$f":"IF(AND(L353=\"WIN\",L354<>\"WIN\"),SUMIF(L$24:L353,\"WIN\",K$24:K353)-SUM(W$23:W352),\"\")","v":""},{"$f":"IF(AND(L353=\"LOSS\",L354<>\"LOSS\"),SUMIF(L$24:L353,\"LOSS\",K$24:K353)-SUM(X$23:X352),\"\")","v":-233.3695059907368}]
[null,"Row 354 (331)",null,3.8128531110990682,null,23103.581093082827,null,231.03581093082826,null,null,277.24297311699388,"WIN",{"$f":"IF(COUNTA($F$6:$F$10)=5,(F355-F24)/F24,\"\")","v":1.3380824066199821},1,"last",null,null,null,null,null,null,null,{"$f":"IF(AND(L354=\"WIN\",L355<>\"WIN\"),SUMIF(L$24:L354,\"WIN\",K$24:K354)-SUM(W$23:W353),\"\")","v":277.24297311699047},{"$f":"IF(AND(L354=\"LOSS\",L355<>\"LOSS\"),SUMIF(L$24:L354,\"LOSS\",K$24:K354)-SUM(X$23:X353),\"\")","v":""}]
[null,"Row 355 (332)",null,86.272843758560086,null,23380.824066199821,null,233.80824066199821,null,null,-233.80824066199821,"LOSS",{"$f":"IF(COUNTA($F$6:$F$10)=5,(F356-F24)/F24,\"\")","v":1.3147015825537822},1,"new",null,null,null,null,null,null,null,{"$f":"IF(AND(L355=\"WIN\",L356<>\"WIN\"),SUMIF(L$24:L355,\"WIN\",K$24:K355)-SUM(W$23:W354),\"\")","v":""},{"$f":"IF(AND(L355=\"LOSS\",L356<>\"LOSS\"),SUMIF(L$24:L355,\"LOSS\",K$24:K355)-SUM(X$23:X354),\"\")","v":""}]
[null,"Row 356 (333)",null,85.447734432083465,null,23147.015825537823,null,231.47015825537824,null,null,-231.47015825537824,"LOSS",{"$f":"IF(COUNTA($F$6:$F$10)=5,(F357-F24)/F24,\"\")","v":1.2915545667282444},2,"middle",null,null,null,null,null,null,null,{"$f":"IF(AND(L356=\"WIN\",L357<>\"WIN\"),SUMIF(L$24:L356,\"WIN\",K$24:K356)-SUM(W$23:W355),\"\")","v":""},{"$f":"IF(AND(L356=\"LOSS\",L357<>\"LOSS\"),SUMIF(L$24:L356,\"LOSS\",K$24:K356)-SUM(X$23:X355),\"\")","v":""}]
[null,"Row 357 (334)",null,98.739810189415152,null,22915.545667282444,null,229.15545667282444,null,null,-229.15545667282444,"LOSS",{"$f":"IF(COUNTA($F$6:$F$10)=5,(F358-F24)/F24,\"\")","v":1.2686390210609617},3,"last",null,null,null,null,null,null,null,{"$f":"IF(AND(L357=\"WIN\",L358<>\"WIN\"),SUMIF(L$24:L357,\"WIN\",K$24:K357)-SUM(W$23:W356),\"\")","v":""},{"$f":"IF(AND(L357=\"LOSS\",L358<>\"LOSS\"),SUMIF(L$24:L357,\"LOSS\",K$24:K357)-SUM(X$23:X356),\"\")","v":-694.43385559019953}]
[null,"Row 358 (335)",null,20.370281977428697,null,22686.390210609617,null,226.86390210609619,null,null,272.23668252731539,"WIN",{"$f":"IF(COUNTA($F$6:$F$10)=5,(F359-F24)/F24,\"\")","v":1.2958626893136933},1,"new",null,null,null,null,null,null,null,{"$f":"IF(AND(L358=\"WIN\",L359<>\"WIN\"),SUMIF(L$24:L358,\"WIN\",K$24:K358)-SUM(W$23:W357),\"\")","v":""},{"$f":"IF(AND(L358=\"LOSS\",L359<>\"LOSS\"),SUMIF(L$24:L358,\"LOSS\",K$24:K358)-SUM(X$23:X357),\"\")","v":""}]
[null,"Row 359 (336)",null,26.668115250705782,null,22958.626893136934,null,229.58626893136935,null,null,275.50352271764319,"WIN",{"$f":"IF(COUNTA($F$6:$F$10)=5,(F360-F24)/F24,\"\")","v":1.3234130415854579},2,"middle",null,null,null,null,null,null,null,{"$f":"IF(AND(L359=\"WIN\",L360<>\"WIN\"),SUMIF(L$24:L359,\"WIN\",K$24:K359)-SUM(W$23:W358),\"\")","v":""},{"$f":"IF(AND(L359=\"LOSS\",L360<>\"LOSS\"),SUMIF(L$24:L359,\"LOSS\",K$24:K359)-SUM(X$23:X358),\"\")","v":""}]
[null,"Row 360 (337)",null,21.872310282642559,null,23234.130415854579,null,232.3413041585458,null,null,278.80956499025496,"WIN",{"$f":"IF(COUNTA($F$6:$F$10)=5,(F361-F24)/F24,\"\")","v":1.3512939980844831},3,"last",null,null,null,null,null,null,null,{"$f":"IF(AND(L360=\"WIN\",L361<>\"WIN\"),SUMIF(L$24:L360,\"WIN\",K$24:K360)-SUM(W$23:W359),\"\")","v":826.54977023520769},{"$f":"IF(AND(L360=\"LOSS\",L361<>\"LOSS\"),SUMIF(L$24:L360,\"LOSS\",K$24:K360)-SUM(X$23:X359),\"\")","v":""}]
[null,"Row 361 (338)",null,84.606982664211628,null,23512.939980844832,null,235.12939980844834,null,null,-235.12939980844834,"LOSS",{"$f":"IF(COUNTA($F$6:$F$10)=5,(F362-F24)/F24,\"\")","v":1.3277810581036384},1,"new",null,null,null,null,null,null,null,{"$f":"IF(AND(L361=\"WIN\",L362<>\"WIN\"),SUMIF(L$24:L361,\"WIN\",K$24:K361)-SUM(W$23:W360),\"\")","v":""},{"$f":"IF(AND(L361=\"LOSS\",L362<>\"LOSS\"),SUMIF(L$24:L361,\"LOSS\",K$24:K361)-SUM(X$23:X360),\"\")","v":""}]
[null,"Row 362 (339)",null,78.258912371697747,null,23277.810581036385,null,232.77810581036385,null,null,-232.77810581036385,"LOSS",{"$f":"IF(COUNTA($F$6:$F$10)=5,(F363-F24)/F24,\"\")","v":1.3045032475226019},2,"last",null,null,null,null,null,null,null,{"$f":"IF(AND(L362=\"WIN\",L363<>\"WIN\"),SUMIF(L$24:L362,\"WIN\",K$24:K362)-SUM(W$23:W361),\"\")","v":""},{"$f":"IF(AND(L362=\"LOSS\",L363<>\"LOSS\"),SUMIF(L$24:L362,\"LOSS\",K$24:K362)-SUM(X$23:X361),\"\")","v":-467.90750561881214}]
[null,"Row 363 (340)",null,27.717850160615541,null,23045.03247522602,null,230.4503247522602,null,null,276.54038970271222,"WIN",{"$f":"IF(COUNTA($F$6:$F$10)=5,(F364-F24)/F24,\"\")","v":1.3321572864928735},1,"last",null,null,null,null,null,null,null,{"$f":"IF(AND(L363=\"WIN\",L364<>\"WIN\"),SUMIF(L$24:L363,\"WIN\",K$24:K363)-SUM(W$23:W362),\"\")","v":276.54038970271358},{"$f":"IF(AND(L363=\"LOSS\",L364<>\"LOSS\"),SUMIF(L$24:L363,\"LOSS\",K$24:K363)-SUM(X$23:X362),\"\")","v":""}]
[null,"Row 364 (341)",null,68.824425668957602,null,23321.572864928734,null,233.21572864928734,null,null,-233.21572864928734,"LOSS",{"$f":"IF(COUNTA($F$6:$F$10)=5,(F365-F24)/F24,\"\")","v":1.3088357136279447},1,"new",null,null,null,null,null,null,null,{"$f":"IF(AND(L364=\"WIN\",L365<>\"WIN\"),SUMIF(L$24:L364,\"WIN\",K$24:K364)-SUM(W$23:W363),\"\")","v":""},{"$f":"IF(AND(L364=\"LOSS\",L365<>\"LOSS\"),SUMIF(L$24:L364,\"LOSS\",K$24:K364)-SUM(X$23:X363),\"\")","v":""}]
[null,"Row 365 (342)",null,76.766133252172381,null,23088.357136279446,null,230.88357136279447,null,null,-230.88357136279447,"LOSS",{"$f":"IF(COUNTA($F$6:$F$10)=5,(F366-F24)/F24,\"\")","v":1.285747356491665},2,"middle",null,null,null,null,null,null,null,{"$f":"IF(AND(L365=\"WIN\",L366<>\"WIN\"),SUMIF(L$24:L365,\"WIN\",K$24:K365)-SUM(W$23:W364),\"\")","v":""},{"$f":"IF(AND(L365=\"LOSS\",L366<>\"LOSS\"),SUMIF(L$24:L365,\"LOSS\",K$24:K365)-SUM(X$23:X364),\"\")","v":""}]
[null,"Row 366 (343)",null,76.248913930390387,null,22857.473564916651,null,228.57473564916651,null,null,-228.57473564916651,"LOSS",{"$f":"IF(COUNTA($F$6:$F$10)=5,(F367-F24)/F24,\"\")","v":1.2628898829267483},3,"last",null,null,null,null,null,null,null,{"$f":"IF(AND(L366=\"WIN\",L367<>\"WIN\"),SUMIF(L$24:L366,\"WIN\",K$24:K366)-SUM(W$23:W365),\"\")","v":""},{"$f":"IF(AND(L366=\"LOSS\",L367<>\"LOSS\"),SUMIF(L$24:L366,\"LOSS\",K$24:K366)-SUM(X$23:X365),\"\")","v":-692.67403566124995}]
[null,"Row 367 (344)",null,46.8537030637033,null,22628.898829267484,null,226.28898829267484,null,null,271.54678595120981,"WIN",{"$f":"IF(COUNTA($F$6:$F$10)=5,(F368-F24)/F24,\"\")","v":1.2900445615218694},1,"new",null,null,null,null,null,null,null,{"$f":"IF(AND(L367=\"WIN\",L368<>\"WIN\"),SUMIF(L$24:L367,\"WIN\",K$24:K367)-SUM(W$23:W366),\"\")","v":""},{"$f":"IF(AND(L367=\"LOSS\",L368<>\"LOSS\"),SUMIF(L$24:L367,\"LOSS\",K$24:K367)-SUM(X$23:X366),\"\")","v":""}]
[null,"Row 368 (345)",null,13.012524631921485,null,22900.445615218694,null,229.00445615218695,null,null,274.80534738262435,"WIN",{"$f":"IF(COUNTA($F$6:$F$10)=5,(F369-F24)/F24,\"\")","v":1.3175250962601319},2,"last",null,null,null,null,null,null,null,{"$f":"IF(AND(L368=\"WIN\",L369<>\"WIN\"),SUMIF(L$24:L368,\"WIN\",K$24:K368)-SUM(W$23:W367),\"\")","v":546.35213333382853},{"$f":"IF(AND(L368=\"LOSS\",L369<>\"LOSS\"),SUMIF(L$24:L368,\"LOSS\",K$24:K368)-SUM(X$23:X367),\"\")","v":""}]
[null,"Row 369 (346)",null,79.947194633843708,null,23175.25096260132,null,231.75250962601319,null,null,-231.75250962601319,"LOSS",{"$f":"IF(COUNTA($F$6:$F$10)=5,(F370-F24)/F24,\"\")","v":1.2943498452975306},1,"new",null,null,null,null,null,null,null,{"$f":"IF(AND(L369=\"WIN\",L370<>\"WIN\"),SUMIF(L$24:L369,\"WIN\",K$24:K369)-SUM(W$23:W368),\"\")","v":""},{"$f":"IF(AND(L369=\"LOSS\",L370<>\"LOSS\"),SUMIF(L$24:L369,\"LOSS\",K$24:K369)-SUM(X$23:X368),\"\")","v":""}]
[null,"Row 370 (347)",null,95.425195546441373,null,22943.498452975306,null,229.43498452975305,null,null,-229.43498452975305,"LOSS",{"$f":"IF(COUNTA($F$6:$F$10)=5,(F371-F24)/F24,\"\")","v":1.2714063468445551},2,"last",null,null,null,null,null,null,null,{"$f":"IF(AND(L370=\"WIN\",L371<>\"WIN\"),SUMIF(L$24:L370,\"WIN\",K$24:K370)-SUM(W$23:W369),\"\")","v":""},{"$f":"IF(AND(L370=\"LOSS\",L371<>\"LOSS\"),SUMIF(L$24:L370,\"LOSS\",K$24:K370)-SUM(X$23:X369),\"\")","v":-461.18749415576895}]
[null,"Row 371 (348)",null,20.224722151882503,null,22714.063468445551,null,227.14063468445551,null,null,272.5687616213466,"WIN",{"$f":"IF(COUNTA($F$6:$F$10)=5,(F372-F24)/F24,\"\")","v":1.2986632230066899},1,"new",null,null,null,null,null,null,null,{"$f":"IF(AND(L371=\"WIN\",L372<>\"WIN\"),SUMIF(L$24:L371,\"WIN\",K$24:K371)-SUM(W$23:W370),\"\")","v":""},{"$f":"IF(AND(L371=\"LOSS\",L372<>\"LOSS\"),SUMIF(L$24:L371,\"LOSS\",K$24:K371)-SUM(X$23:X370),\"\")","v":""}]
[null,"Row 372 (349)",null,8.4329157166112996,null,22986.632230066898,null,229.866322300669,null,null,275.83958676080277,"WIN",{"$f":"IF(COUNTA($F$6:$F$10)=5,(F373-F24)/F24,\"\")","v":1.3262471816827699},2,"middle",null,null,null,null,null,null,null,{"$f":"IF(AND(L372=\"WIN\",L373<>\"WIN\"),SUMIF(L$24:L372,\"WIN\",K$24:K372)-SUM(W$23:W371),\"\")","v":""},{"$f":"IF(AND(L372=\"LOSS\",L373<>\"LOSS\"),SUMIF(L$24:L372,\"LOSS\",K$24:K372)-SUM(X$23:X371),\"\")","v":""}]
[null,"Row 373 (350)",null,8.1798545953912001,null,23262.4718168277,null,232.62471816827701,null,null,279.14966180193238,"WIN",{"$f":"IF(COUNTA($F$6:$F$10)=5,(F374-F24)/F24,\"\")","v":1.3541621478629633},3,"last",null,null,null,null,null,null,null,{"$f":"IF(AND(L373=\"WIN\",L374<>\"WIN\"),SUMIF(L$24:L373,\"WIN\",K$24:K373)-SUM(W$23:W372),\"\")","v":827.55801018408238},{"$f":"IF(AND(L373=\"LOSS\",L374<>\"LOSS\"),SUMIF(L$24:L373,\"LOSS\",K$24:K373)-SUM(X$23:X372),\"\")","v":""}]
[null,"Row 374 (351)",null,90.569504877910916,null,23541.621478629633,null,235.41621478629634,null,null,-235.41621478629634,"LOSS",{"$f":"IF(COUNTA($F$6:$F$10)=5,(F375-F24)/F24,\"\")","v":1.3306205263843338},1,"last",null,null,null,null,null,null,null,{"$f":"IF(AND(L374=\"WIN\",L375<>\"WIN\"),SUMIF(L$24:L374,\"WIN\",K$24:K374)-SUM(W$23:W373),\"\")","v":""},{"$f":"IF(AND(L374=\"LOSS\",L375<>\"LOSS\"),SUMIF(L$24:L374,\"LOSS\",K$24:K374)-SUM(X$23:X373),\"\")","v":-235.41621478629531}]
[null,"Row 375 (352)",null,35.065278290500466,null,23306.205263843338,null,233.06205263843339,null,null,279.67446316612006,"WIN",{"$f":"IF(COUNTA($F$6:$F$10)=5,(F376-F24)/F24,\"\")","v":1.3585879727009458},1,"last",null,null,null,null,null,null,null,{"$f":"IF(AND(L375=\"WIN\",L376<>\"WIN\"),SUMIF(L$24:L375,\"WIN\",K$24:K375)-SUM(W$23:W374),\"\")","v":279.6744631661204},{"$f":"IF(AND(L375=\"LOSS\",L376<>\"LOSS\"),SUMIF(L$24:L375,\"LOSS\",K$24:K375)-SUM(X$23:X374),\"\")","v":""}]
[null,"Row 376 (353)",null,90.477652406353812,null,23585.879727009458,null,235.85879727009458,null,null,-235.85879727009458,"LOSS",{"$f":"IF(COUNTA($F$6:$F$10)=5,(F377-F24)/F24,\"\")","v":1.3350020929739363},1,"last",null,null,null,null,null,null,null,{"$f":"IF(AND(L376=\"WIN\",L377<>\"WIN\"),SUMIF(L$24:L376,\"WIN\",K$24:K376)-SUM(W$23:W375),\"\")","v":""},{"$f":"IF(AND(L376=\"LOSS\",L377<>\"LOSS\"),SUMIF(L$24:L376,\"LOSS\",K$24:K376)-SUM(X$23:X375),\"\")","v":-235.85879727009524}]
[null,"Row 377 (354)",null,45.563084516411436,null,23350.020929739363,null,233.50020929739364,null,null,280.20025115687235,"WIN",{"$f":"IF(COUNTA($F$6:$F$10)=5,(F378-F24)/F24,\"\")","v":1.3630221180896234},1,"last",null,null,null,null,null,null,null,{"$f":"IF(AND(L377=\"WIN\",L378<>\"WIN\"),SUMIF(L$24:L377,\"WIN\",K$24:K377)-SUM(W$23:W376),\"\")","v":280.20025115687167},{"$f":"IF(AND(L377=\"LOSS\",L378<>\"LOSS\"),SUMIF(L$24:L377,\"LOSS\",K$24:K377)-SUM(X$23:X376),\"\")","v":""}]
[null,"Row 378 (355)",null,56.144911675963897,null,23630.221180896235,null,236.30221180896234,null,null,-236.30221180896234,"LOSS",{"$f":"IF(COUNTA($F$6:$F$10)=5,(F379-F24)/F24,\"\")","v":1.3393918969087273},1,"last",null,null,null,null,null,null,null,{"$f":"IF(AND(L378=\"WIN\",L379<>\"WIN\"),SUMIF(L$24:L378,\"WIN\",K$24:K378)-SUM(W$23:W377),\"\")","v":""},{"$f":"IF(AND(L378=\"LOSS\",L379<>\"LOSS\"),SUMIF(L$24:L378,\"LOSS\",K$24:K378)-SUM(X$23:X377),\"\")","v":-236.30221180896115}]
[null,"Row 379 (356)",null,23.812238079923752,null,23393.918969087274,null,233.93918969087275,null,null,280.72702762904731,"WIN",{"$f":"IF(COUNTA($F$6:$F$10)=5,(F380-F24)/F24,\"\")","v":1.3674645996716321},1,"new",null,null,null,null,null,null,null,{"$f":"IF(AND(L379=\"WIN\",L380<>\"WIN\"),SUMIF(L$24:L379,\"WIN\",K$24:K379)-SUM(W$23:W378),\"\")","v":""},{"$f":"IF(AND(L379=\"LOSS\",L380<>\"LOSS\"),SUMIF(L$24:L379,\"LOSS\",K$24:K379)-SUM(X$23:X378),\"\")","v":""}]
[null,"Row 380 (357)",null,15.515707379696252,null,23674.645996716321,null,236.74645996716322,null,null,284.09575196059586,"WIN",{"$f":"IF(COUNTA($F$6:$F$10)=5,(F381-F24)/F24,\"\")","v":1.3958741748676915},2,"last",null,null,null,null,null,null,null,{"$f":"IF(AND(L380=\"WIN\",L381<>\"WIN\"),SUMIF(L$24:L380,\"WIN\",K$24:K380)-SUM(W$23:W379),\"\")","v":564.82277958963823},{"$f":"IF(AND(L380=\"LOSS\",L381<>\"LOSS\"),SUMIF(L$24:L380,\"LOSS\",K$24:K380)-SUM(X$23:X379),\"\")","v":""}]
[null,"Row 381 (358)",null,88.098909705468031,null,23958.741748676915,null,239.58741748676917,null,null,-239.58741748676917,"LOSS",{"$f":"IF(COUNTA($F$6:$F$10)=5,(F382-F24)/F24,\"\")","v":1.3719154331190149},1,"new",null,null,null,null,null,null,null,{"$f":"IF(AND(L381=\"WIN\",L382<>\"WIN\"),SUMIF(L$24:L381,\"WIN\",K$24:K381)-SUM(W$23:W380),\"\")","v":""},{"$f":"IF(AND(L381=\"LOSS\",L382<>\"LOSS\"),SUMIF(L$24:L381,\"LOSS\",K$24:K381)-SUM(X$23:X380),\"\")","v":""}]
[null,"Row 382 (359)",null,70.53087695911961,null,23719.154331190148,null,237.19154331190148,null,null,-237.19154331190148,"LOSS",{"$f":"IF(COUNTA($F$6:$F$10)=5,(F383-F24)/F24,\"\")","v":1.3481962787878246},2,"middle",null,null,null,null,null,null,null,{"$f":"IF(AND(L382=\"WIN\",L383<>\"WIN\"),SUMIF(L$24:L382,\"WIN\",K$24:K382)-SUM(W$23:W381),\"\")","v":""},{"$f":"IF(AND(L382=\"LOSS\",L383<>\"LOSS\"),SUMIF(L$24:L382,\"LOSS\",K$24:K382)-SUM(X$23:X381),\"\")","v":""}]
[null,"Row 383 (360)",null,69.120190360627902,null,23481.962787878245,null,234.81962787878246,null,null,-234.81962787878246,"LOSS",{"$f":"IF(COUNTA($F$6:$F$10)=5,(F384-F24)/F24,\"\")","v":1.3247143159999462},3,"middle",null,null,null,null,null,null,null,{"$f":"IF(AND(L383=\"WIN\",L384<>\"WIN\"),SUMIF(L$24:L383,\"WIN\",K$24:K383)-SUM(W$23:W382),\"\")","v":""},{"$f":"IF(AND(L383=\"LOSS\",L384<>\"LOSS\"),SUMIF(L$24:L383,\"LOSS\",K$24:K383)-SUM(X$23:X382),\"\")","v":""}]
[null,"Row 384 (361)",null,63.298143470731304,null,23247.143159999461,null,232.47143159999462,null,null,-232.47143159999462,"LOSS",{"$f":"IF(COUNTA($F$6:$F$10)=5,(F385-F24)/F24,\"\")","v":1.3014671728399465},4,"last",null,null,null,null,null,null,null,{"$f":"IF(AND(L384=\"WIN\",L385<>\"WIN\"),SUMIF(L$24:L384,\"WIN\",K$24:K384)-SUM(W$23:W383),\"\")","v":""},{"$f":"IF(AND(L384=\"LOSS\",L385<>\"LOSS\"),SUMIF(L$24:L384,\"LOSS\",K$24:K384)-SUM(X$23:X383),\"\")","v":-944.07002027744966}]
[null,"Row 385 (362)",null,26.555198283325833,null,23014.671728399466,null,230.14671728399466,null,null,276.17606074079356,"WIN",{"$f":"IF(COUNTA($F$6:$F$10)=5,(F386-F24)/F24,\"\")","v":1.3290847789140259},1,"last",null,null,null,null,null,null,null,{"$f":"IF(AND(L385=\"WIN\",L386<>\"WIN\"),SUMIF(L$24:L385,\"WIN\",K$24:K385)-SUM(W$23:W384),\"\")","v":276.17606074079231},{"$f":"IF(AND(L385=\"LOSS\",L386<>\"LOSS\"),SUMIF(L$24:L385,\"LOSS\",K$24:K385)-SUM(X$23:X384),\"\")","v":""}]
[null,"Row 386 (363)",null,74.52284485315792,null,23290.847789140258,null,232.90847789140258,null,null,-232.90847789140258,"LOSS",{"$f":"IF(COUNTA($F$6:$F$10)=5,(F387-F24)/F24,\"\")","v":1.3057939311248854},1,"last",null,null,null,null,null,null,null,{"$f":"IF(AND(L386=\"WIN\",L387<>\"WIN\"),SUMIF(L$24:L386,\"WIN\",K$24:K386)-SUM(W$23:W385),\"\")","v":""},{"$f":"IF(AND(L386=\"LOSS\",L387<>\"LOSS\"),SUMIF(L$24:L386,\"LOSS\",K$24:K386)-SUM(X$23:X385),\"\")","v":-232.90847789140389}]
[null,"Row 387 (364)",null,50.257397193815493,null,23057.939311248854,null,230.57939311248856,null,null,276.69527173498625,"WIN",{"$f":"IF(COUNTA($F$6:$F$10)=5,(F388-F24)/F24,\"\")","v":1.333463458298384},1,"new",null,null,null,null,null,null,null,{"$f":"IF(AND(L387=\"WIN\",L388<>\"WIN\"),SUMIF(L$24:L387,\"WIN\",K$24:K387)-SUM(W$23:W386),\"\")","v":""},{"$f":"IF(AND(L387=\"LOSS\",L388<>\"LOSS\"),SUMIF(L$24:L387,\"LOSS\",K$24:K387)-SUM(X$23:X386),\"\")","v":""}]
[null,"Row 388 (365)",null,5.3715035244638942,null,23334.634582983839,null,233.34634582983838,null,null,280.01561499580606,"WIN",{"$f":"IF(COUNTA($F$6:$F$10)=5,(F389-F24)/F24,\"\")","v":1.3614650197979645},2,"middle",null,null,null,null,null,null,null,{"$f":"IF(AND(L388=\"WIN\",L389<>\"WIN\"),SUMIF(L$24:L388,\"WIN\",K$24:K388)-SUM(W$23:W387),\"\")","v":""},{"$f":"IF(AND(L388=\"LOSS\",L389<>\"LOSS\"),SUMIF(L$24:L388,\"LOSS\",K$24:K388)-SUM(X$23:X387),\"\")","v":""}]
[null,"Row 389 (366)",null,25.097994975954375,null,23614.650197979645,null,236.14650197979645,null,null,283.37580237575571,"WIN",{"$f":"IF(COUNTA($F$6:$F$10)=5,(F390-F24)/F24,\"\")","v":1.3898026000355399},3,"last",null,null,null,null,null,null,null,{"$f":"IF(AND(L389=\"WIN\",L390<>\"WIN\"),SUMIF(L$24:L389,\"WIN\",K$24:K389)-SUM(W$23:W388),\"\")","v":840.08668910654524},{"$f":"IF(AND(L389=\"LOSS\",L390<>\"LOSS\"),SUMIF(L$24:L389,\"LOSS\",K$24:K389)-SUM(X$23:X388),\"\")","v":""}]
[null,"Row 390 (367)",null,92.374521436281498,null,23898.026000355399,null,238.98026000355401,null,null,-238.98026000355401,"LOSS",{"$f":"IF(COUNTA($F$6:$F$10)=5,(F391-F24)/F24,\"\")","v":1.3659045740351845},1,"last",null,null,null,null,null,null,null,{"$f":"IF(AND(L390=\"WIN\",L391<>\"WIN\"),SUMIF(L$24:L390,\"WIN\",K$24:K390)-SUM(W$23:W389),\"\")","v":""},{"$f":"IF(AND(L390=\"LOSS\",L391<>\"LOSS\"),SUMIF(L$24:L390,\"LOSS\",K$24:K390)-SUM(X$23:X389),\"\")","v":-238.98026000355458}]
[null,"Row 391 (368)",null,22.915021054032437,null,23659.045740351845,null,236.59045740351846,null,null,283.90854888422211,"WIN",{"$f":"IF(COUNTA($F$6:$F$10)=5,(F392-F24)/F24,\"\")","v":1.3942954289236067},1,"new",null,null,null,null,null,null,null,{"$f":"IF(AND(L391=\"WIN\",L392<>\"WIN\"),SUMIF(L$24:L391,\"WIN\",K$24:K391)-SUM(W$23:W390),\"\")","v":""},{"$f":"IF(AND(L391=\"LOSS\",L392<>\"LOSS\"),SUMIF(L$24:L391,\"LOSS\",K$24:K391)-SUM(X$23:X390),\"\")","v":""}]
[null,"Row 392 (369)",null,30.819437440106611,null,23942.954289236066,null,239.42954289236067,null,null,287.31545147083278,"WIN",{"$f":"IF(COUNTA($F$6:$F$10)=5,(F393-F24)/F24,\"\")","v":1.42302697407069},2,"middle",null,null,null,null,null,null,null,{"$f":"IF(AND(L392=\"WIN\",L393<>\"WIN\"),SUMIF(L$24:L392,\"WIN\",K$24:K392)-SUM(W$23:W391),\"\")","v":""},{"$f":"IF(AND(L392=\"LOSS\",L393<>\"LOSS\"),SUMIF(L$24:L392,\"LOSS\",K$24:K392)-SUM(X$23:X391),\"\")","v":""}]
[null,"Row 393 (370)",null,1.2153157443531515,null,24230.269740706899,null,242.30269740706899,null,null,290.76323688848277,"WIN",{"$f":"IF(COUNTA($F$6:$F$10)=5,(F394-F24)/F24,\"\")","v":1.4521032977595383},3,"last",null,null,null,null,null,null,null,{"$f":"IF(AND(L393=\"WIN\",L394<>\"WIN\"),SUMIF(L$24:L393,\"WIN\",K$24:K393)-SUM(W$23:W392),\"\")","v":861.98723724353476},{"$f":"IF(AND(L393=\"LOSS\",L394<>\"LOSS\"),SUMIF(L$24:L393,\"LOSS\",K$24:K393)-SUM(X$23:X392),\"\")","v":""}]
[null,"Row 394 (371)",null,64.711693027666001,null,24521.032977595383,null,245.21032977595382,null,null,-245.21032977595382,"LOSS",{"$f":"IF(COUNTA($F$6:$F$10)=5,(F395-F24)/F24,\"\")","v":1.4275822647819429},1,"new",null,null,null,null,null,null,null,{"$f":"IF(AND(L394=\"WIN\",L395<>\"WIN\"),SUMIF(L$24:L394,\"WIN\",K$24:K394)-SUM(W$23:W393),\"\")","v":""},{"$f":"IF(AND(L394=\"LOSS\",L395<>\"LOSS\"),SUMIF(L$24:L394,\"LOSS\",K$24:K394)-SUM(X$23:X393),\"\")","v":""}]
[null,"Row 395 (372)",null,91.545078821420361,null,24275.82264781943,null,242.7582264781943,null,null,-242.7582264781943,"LOSS",{"$f":"IF(COUNTA($F$6:$F$10)=5,(F396-F24)/F24,\"\")","v":1.4033064421341235},2,"last",null,null,null,null,null,null,null,{"$f":"IF(AND(L395=\"WIN\",L396<>\"WIN\"),SUMIF(L$24:L395,\"WIN\",K$24:K395)-SUM(W$23:W394),\"\")","v":""},{"$f":"IF(AND(L395=\"LOSS\",L396<>\"LOSS\"),SUMIF(L$24:L395,\"LOSS\",K$24:K395)-SUM(X$23:X394),\"\")","v":-487.96855625414901}]
[null,"Row 396 (373)",null,25.01570598763324,null,24033.064421341234,null,240.33064421341234,null,null,288.39677305609479,"WIN",{"$f":"IF(COUNTA($F$6:$F$10)=5,(F397-F24)/F24,\"\")","v":1.4321461194397329},1,"last",null,null,null,null,null,null,null,{"$f":"IF(AND(L396=\"WIN\",L397<>\"WIN\"),SUMIF(L$24:L396,\"WIN\",K$24:K396)-SUM(W$23:W395),\"\")","v":288.39677305609803},{"$f":"IF(AND(L396=\"LOSS\",L397<>\"LOSS\"),SUMIF(L$24:L396,\"LOSS\",K$24:K396)-SUM(X$23:X395),\"\")","v":""}]
[null,"Row 397 (374)",null,58.126096381503167,null,24321.461194397329,null,243.2146119439733,null,null,-243.2146119439733,"LOSS",{"$f":"IF(COUNTA($F$6:$F$10)=5,(F398-F24)/F24,\"\")","v":1.4078246582453353},1,"last",null,null,null,null,null,null,null,{"$f":"IF(AND(L397=\"WIN\",L398<>\"WIN\"),SUMIF(L$24:L397,\"WIN\",K$24:K397)-SUM(W$23:W396),\"\")","v":""},{"$f":"IF(AND(L397=\"LOSS\",L398<>\"LOSS\"),SUMIF(L$24:L397,\"LOSS\",K$24:K397)-SUM(X$23:X396),\"\")","v":-243.21461194397489}]
[null,"Row 398 (375)",null,7.6325801012339216,null,24078.246582453354,null,240.78246582453355,null,null,288.93895898944027,"WIN",{"$f":"IF(COUNTA($F$6:$F$10)=5,(F399-F24)/F24,\"\")","v":1.4367185541442795},1,"last",null,null,null,null,null,null,null,{"$f":"IF(AND(L398=\"WIN\",L399<>\"WIN\"),SUMIF(L$24:L398,\"WIN\",K$24:K398)-SUM(W$23:W397),\"\")","v":288.93895898944174},{"$f":"IF(AND(L398=\"LOSS\",L399<>\"LOSS\"),SUMIF(L$24:L398,\"LOSS\",K$24:K398)-SUM(X$23:X397),\"\")","v":""}]
[null,"Row 399 (376)",null,61.050854865094685,null,24367.185541442796,null,243.67185541442797,null,null,-243.67185541442797,"LOSS",{"$f":"IF(COUNTA($F$6:$F$10)=5,(F400-F24)/F24,\"\")","v":1.4123513686028368},1,"last",null,null,null,null,null,null,null,{"$f":"IF(AND(L399=\"WIN\",L400<>\"WIN\"),SUMIF(L$24:L399,\"WIN\",K$24:K399)-SUM(W$23:W398),\"\")","v":""},{"$f":"IF(AND(L399=\"LOSS\",L400<>\"LOSS\"),SUMIF(L$24:L399,\"LOSS\",K$24:K399)-SUM(X$23:X398),\"\")","v":-243.67185541442814}]
[null,"Row 400 (377)",null,16.22619030764001,null,24123.513686028367,null,241.23513686028369,null,null,289.48216423234044,"WIN",{"$f":"IF(COUNTA($F$6:$F$10)=5,(F401-F24)/F24,\"\")","v":1.4412995850260708},1,"last",null,null,null,null,null,null,null,{"$f":"IF(AND(L400=\"WIN\",L401<>\"WIN\"),SUMIF(L$24:L400,\"WIN\",K$24:K400)-SUM(W$23:W399),\"\")","v":289.48216423234408},{"$f":"IF(AND(L400=\"LOSS\",L401<>\"LOSS\"),SUMIF(L$24:L400,\"LOSS\",K$24:K400)-SUM(X$23:X399),\"\")","v":""}]
[null,"Row 401 (378)",null,85.03087819335245,null,24412.995850260708,null,244.12995850260708,null,null,-244.12995850260708,"LOSS",{"$f":"IF(COUNTA($F$6:$F$10)=5,(F402-F24)/F24,\"\")","v":1.4168865891758102},1,"last",null,null,null,null,null,null,null,{"$f":"IF(AND(L401=\"WIN\",L402<>\"WIN\"),SUMIF(L$24:L401,\"WIN\",K$24:K401)-SUM(W$23:W400),\"\")","v":""},{"$f":"IF(AND(L401=\"LOSS\",L402<>\"LOSS\"),SUMIF(L$24:L401,\"LOSS\",K$24:K401)-SUM(X$23:X400),\"\")","v":-244.12995850260631}]
[null,"Row 402 (379)",null,6.3565257880072394,null,24168.865891758101,null,241.68865891758102,null,null,290.02639070109723,"WIN",{"$f":"IF(COUNTA($F$6:$F$10)=5,(F403-F24)/F24,\"\")","v":1.4458892282459197},1,"new",null,null,null,null,null,null,null,{"$f":"IF(AND(L402=\"WIN\",L403<>\"WIN\"),SUMIF(L$24:L402,\"WIN\",K$24:K402)-SUM(W$23:W401),\"\")","v":""},{"$f":"IF(AND(L402=\"LOSS\",L403<>\"LOSS\"),SUMIF(L$24:L402,\"LOSS\",K$24:K402)-SUM(X$23:X401),\"\")","v":""}]
[null,"Row 403 (380)",null,22.76916088808435,null,24458.892282459197,null,244.58892282459198,null,null,293.50670738951038,"WIN",{"$f":"IF(COUNTA($F$6:$F$10)=5,(F404-F24)/F24,\"\")","v":1.475239898984871},2,"last",null,null,null,null,null,null,null,{"$f":"IF(AND(L403=\"WIN\",L404<>\"WIN\"),SUMIF(L$24:L403,\"WIN\",K$24:K403)-SUM(W$23:W402),\"\")","v":583.53309809060738},{"$f":"IF(AND(L403=\"LOSS\",L404<>\"LOSS\"),SUMIF(L$24:L403,\"LOSS\",K$24:K403)-SUM(X$23:X402),\"\")","v":""}]
[null,"Row 404 (381)",null,64.315985673899604,null,24752.398989848709,null,247.52398989848709,null,null,-247.52398989848709,"LOSS",{"$f":"IF(COUNTA($F$6:$F$10)=5,(F405-F24)/F24,\"\")","v":1.4504874999950221},1,"last",null,null,null,null,null,null,null,{"$f":"IF(AND(L404=\"WIN\",L405<>\"WIN\"),SUMIF(L$24:L404,\"WIN\",K$24:K404)-SUM(W$23:W403),\"\")","v":""},{"$f":"IF(AND(L404=\"LOSS\",L405<>\"LOSS\"),SUMIF(L$24:L404,\"LOSS\",K$24:K404)-SUM(X$23:X403),\"\")","v":-247.52398989848734}]
[null,"Row 405 (382)",null,39.910546626665486,null,24504.874999950222,null,245.04874999950221,null,null,294.05849999940261,"WIN",{"$f":"IF(COUNTA($F$6:$F$10)=5,(F406-F24)/F24,\"\")","v":1.4798933499949625},1,"last",null,null,null,null,null,null,null,{"$f":"IF(AND(L405=\"WIN\",L406<>\"WIN\"),SUMIF(L$24:L405,\"WIN\",K$24:K405)-SUM(W$23:W404),\"\")","v":294.05849999940256},{"$f":"IF(AND(L405=\"LOSS\",L406<>\"LOSS\"),SUMIF(L$24:L405,\"LOSS\",K$24:K405)-SUM(X$23:X404),\"\")","v":""}]
[null,"Row 406 (383)",null,86.780441704471428,null,24798.933499949624,null,247.98933499949624,null,null,-247.98933499949624,"LOSS",{"$f":"IF(COUNTA($F$6:$F$10)=5,(F407-F24)/F24,\"\")","v":1.4550944164950128},1,"new",null,null,null,null,null,null,null,{"$f":"IF(AND(L406=\"WIN\",L407<>\"WIN\"),SUMIF(L$24:L406,\"WIN\",K$24:K406)-SUM(W$23:W405),\"\")","v":""},{"$f":"IF(AND(L406=\"LOSS\",L407<>\"LOSS\"),SUMIF(L$24:L406,\"LOSS\",K$24:K406)-SUM(X$23:X405),\"\")","v":""}]
[null,"Row 407 (384)",null,92.411341422949235,null,24550.944164950128,null,245.50944164950127,null,null,-245.50944164950127,"LOSS",{"$f":"IF(COUNTA($F$6:$F$10)=5,(F408-F24)/F24,\"\")","v":1.4305434723300627},2,"last",null,null,null,null,null,null,null,{"$f":"IF(AND(L407=\"WIN\",L408<>\"WIN\"),SUMIF(L$24:L407,\"WIN\",K$24:K407)-SUM(W$23:W406),\"\")","v":""},{"$f":"IF(AND(L407=\"LOSS\",L408<>\"LOSS\"),SUMIF(L$24:L407,\"LOSS\",K$24:K407)-SUM(X$23:X406),\"\")","v":-493.49877664899759}]
[null,"Row 408 (385)",null,13.770738552865724,null,24305.434723300627,null,243.05434723300627,null,null,291.66521667960751,"WIN",{"$f":"IF(COUNTA($F$6:$F$10)=5,(F409-F24)/F24,\"\")","v":1.4597099939980236},1,"new",null,null,null,null,null,null,null,{"$f":"IF(AND(L408=\"WIN\",L409<>\"WIN\"),SUMIF(L$24:L408,\"WIN\",K$24:K408)-SUM(W$23:W407),\"\")","v":""},{"$f":"IF(AND(L408=\"LOSS\",L409<>\"LOSS\"),SUMIF(L$24:L408,\"LOSS\",K$24:K408)-SUM(X$23:X407),\"\")","v":""}]
[null,"Row 409 (386)",null,{"$f":"IF(COUNTA($F$6:$F$10)=5,100*RAND(),\"\")","v":39.694317301328105},null,24597.099939980235,null,{"$f":"IF(COUNTBLANK($F$6:$F$10),\"\",F409*$F$7)","v":245.97099939980237},null,null,295.16519927976282,{"$f":"IF(D409=\"\",\"\",IF(D409<$F$8,\"WIN\",\"LOSS\"))","v":"WIN"},{"$f":"IF(COUNTA($F$6:$F$10)=5,(F410-F24)/F24,\"\")","v":1.4892265139259999},{"$f":"IF(L409=L408,N408+1,1)","v":2},{"$f":"IF(N409=1,IF(N410=1,\"last\",\"new\"),IF(N410=1,\"last\",\"middle\"))","v":"last"},null,null,null,null,null,null,null,{"$f":"IF(AND(L409=\"WIN\",L410<>\"WIN\"),SUMIF(L$24:L409,\"WIN\",K$24:K409)-SUM(W$23:W408),\"\")","v":586.83041595936811},{"$f":"IF(AND(L409=\"LOSS\",L410<>\"LOSS\"),SUMIF(L$24:L409,\"LOSS\",K$24:K409)-SUM(X$23:X408),\"\")","v":""}]
[null,"Row 410 (387)",null,63.47673286640061,null,{"$f":"IF(COUNTBLANK($F$6:$F$10),\"\",IF(D409<$F$8,(1+$F$7*$F$9)*F409-$F$10,(1-$F$7)*F409-$F$10))","v":24892.265139259998},null,248.92265139259999,null,null,{"$f":"IF(COUNTBLANK($F$6:$F$10),\"\", IF(L410=\"win\", H410*$F$9-$F$10, IF(L410=\"loss\", -H410-$F$10)))","v":-248.92265139259999},"LOSS",{"$f":"IF(COUNTA($F$6:$F$10)=5,(F411-F24)/F24,\"\")","v":1.4643342487867397},1,"new",null,null,null,null,null,null,null,{"$f":"IF(AND(L410=\"WIN\",L411<>\"WIN\"),SUMIF(L$24:L410,\"WIN\",K$24:K410)-SUM(W$23:W409),\"\")","v":""},{"$f":"IF(AND(L410=\"LOSS\",L411<>\"LOSS\"),SUMIF(L$24:L410,\"LOSS\",K$24:K410)-SUM(X$23:X409),\"\")","v":""}]
[null,"Row 411 (388)",null,87.990073549501957,null,24643.342487867398,null,246.43342487867397,null,null,-246.43342487867397,"LOSS",{"$f":"IF(COUNTA($F$6:$F$10)=5,(F412-F24)/F24,\"\")","v":1.4396909062988725},2,"middle",null,null,null,null,null,null,null,{"$f":"IF(AND(L411=\"WIN\",L412<>\"WIN\"),SUMIF(L$24:L411,\"WIN\",K$24:K411)-SUM(W$23:W410),\"\")","v":""},{"$f":"IF(AND(L411=\"LOSS\",L412<>\"LOSS\"),SUMIF(L$24:L411,\"LOSS\",K$24:K411)-SUM(X$23:X410),\"\")","v":""}]
[null,"Row 412 (389)",null,82.105382566753178,null,24396.909062988725,null,243.96909062988726,null,null,-243.96909062988726,"LOSS",{"$f":"IF(COUNTA($F$6:$F$10)=5,(F413-F24)/F24,\"\")","v":1.4152939972358836},3,"middle",null,null,null,null,null,null,null,{"$f":"IF(AND(L412=\"WIN\",L413<>\"WIN\"),SUMIF(L$24:L412,\"WIN\",K$24:K412)-SUM(W$23:W411),\"\")","v":""},{"$f":"IF(AND(L412=\"LOSS\",L413<>\"LOSS\"),SUMIF(L$24:L412,\"LOSS\",K$24:K412)-SUM(X$23:X411),\"\")","v":""}]
[null,"Row 413 (390)",null,89.59039884966316,null,24152.939972358836,null,241.52939972358837,null,null,-241.52939972358837,"LOSS",{"$f":"IF(COUNTA($F$6:$F$10)=5,(F414-F24)/F24,\"\")","v":1.3911410572635245},4,"last",null,null,null,null,null,null,null,{"$f":"IF(AND(L413=\"WIN\",L414<>\"WIN\"),SUMIF(L$24:L413,\"WIN\",K$24:K413)-SUM(W$23:W412),\"\")","v":""},{"$f":"IF(AND(L413=\"LOSS\",L414<>\"LOSS\"),SUMIF(L$24:L413,\"LOSS\",K$24:K413)-SUM(X$23:X412),\"\")","v":-980.85456662474826}]
[null,"Row 414 (391)",null,36.642761422082792,null,23911.410572635246,null,239.11410572635248,null,null,286.93692687162297,"WIN",{"$f":"IF(COUNTA($F$6:$F$10)=5,(F415-F24)/F24,\"\")","v":1.4198347499506869},1,"last",null,null,null,null,null,null,null,{"$f":"IF(AND(L414=\"WIN\",L415<>\"WIN\"),SUMIF(L$24:L414,\"WIN\",K$24:K414)-SUM(W$23:W413),\"\")","v":286.93692687162547},{"$f":"IF(AND(L414=\"LOSS\",L415<>\"LOSS\"),SUMIF(L$24:L414,\"LOSS\",K$24:K414)-SUM(X$23:X413),\"\")","v":""}]
[null,"Row 415 (392)",null,99.869543869124669,null,24198.347499506868,null,241.98347499506869,null,null,-241.98347499506869,"LOSS",{"$f":"IF(COUNTA($F$6:$F$10)=5,(F416-F24)/F24,\"\")","v":1.39563640245118},1,"new",null,null,null,null,null,null,null,{"$f":"IF(AND(L415=\"WIN\",L416<>\"WIN\"),SUMIF(L$24:L415,\"WIN\",K$24:K415)-SUM(W$23:W414),\"\")","v":""},{"$f":"IF(AND(L415=\"LOSS\",L416<>\"LOSS\"),SUMIF(L$24:L415,\"LOSS\",K$24:K415)-SUM(X$23:X414),\"\")","v":""}]
[null,"Row 416 (393)",null,57.366645230759957,null,23956.3640245118,null,239.56364024511799,null,null,-239.56364024511799,"LOSS",{"$f":"IF(COUNTA($F$6:$F$10)=5,(F417-F24)/F24,\"\")","v":1.3716800384266683},2,"last",null,null,null,null,null,null,null,{"$f":"IF(AND(L416=\"WIN\",L417<>\"WIN\"),SUMIF(L$24:L416,\"WIN\",K$24:K416)-SUM(W$23:W415),\"\")","v":""},{"$f":"IF(AND(L416=\"LOSS\",L417<>\"LOSS\"),SUMIF(L$24:L416,\"LOSS\",K$24:K416)-SUM(X$23:X415),\"\")","v":-481.54711524018421}]
[null,"Row 417 (394)",null,39.064862163152561,null,23716.800384266684,null,237.16800384266685,null,null,284.60160461120023,"WIN",{"$f":"IF(COUNTA($F$6:$F$10)=5,(F418-F24)/F24,\"\")","v":1.4001401988877886},1,"new",null,null,null,null,null,null,null,{"$f":"IF(AND(L417=\"WIN\",L418<>\"WIN\"),SUMIF(L$24:L417,\"WIN\",K$24:K417)-SUM(W$23:W416),\"\")","v":""},{"$f":"IF(AND(L417=\"LOSS\",L418<>\"LOSS\"),SUMIF(L$24:L417,\"LOSS\",K$24:K417)-SUM(X$23:X416),\"\")","v":""}]
[null,"Row 418 (395)",null,49.497502764270507,null,24001.401988877886,null,240.01401988877888,null,null,288.01682386653465,"WIN",{"$f":"IF(COUNTA($F$6:$F$10)=5,(F419-F24)/F24,\"\")","v":1.4289418812744421},2,"middle",null,null,null,null,null,null,null,{"$f":"IF(AND(L418=\"WIN\",L419<>\"WIN\"),SUMIF(L$24:L418,\"WIN\",K$24:K418)-SUM(W$23:W417),\"\")","v":""},{"$f":"IF(AND(L418=\"LOSS\",L419<>\"LOSS\"),SUMIF(L$24:L418,\"LOSS\",K$24:K418)-SUM(X$23:X417),\"\")","v":""}]
[null,"Row 419 (396)",null,21.925870020704163,null,24289.418812744421,null,242.89418812744421,null,null,291.47302575293304,"WIN",{"$f":"IF(COUNTA($F$6:$F$10)=5,(F420-F24)/F24,\"\")","v":1.4580891838497354},3,"last",null,null,null,null,null,null,null,{"$f":"IF(AND(L419=\"WIN\",L420<>\"WIN\"),SUMIF(L$24:L419,\"WIN\",K$24:K419)-SUM(W$23:W418),\"\")","v":864.09145423066366},{"$f":"IF(AND(L419=\"LOSS\",L420<>\"LOSS\"),SUMIF(L$24:L419,\"LOSS\",K$24:K419)-SUM(X$23:X418),\"\")","v":""}]
[null,"Row 420 (397)",null,83.420300438877533,null,24580.891838497355,null,245.80891838497357,null,null,-245.80891838497357,"LOSS",{"$f":"IF(COUNTA($F$6:$F$10)=5,(F421-F24)/F24,\"\")","v":1.4335082920112381},1,"new",null,null,null,null,null,null,null,{"$f":"IF(AND(L420=\"WIN\",L421<>\"WIN\"),SUMIF(L$24:L420,\"WIN\",K$24:K420)-SUM(W$23:W419),\"\")","v":""},{"$f":"IF(AND(L420=\"LOSS\",L421<>\"LOSS\"),SUMIF(L$24:L420,\"LOSS\",K$24:K420)-SUM(X$23:X419),\"\")","v":""}]
[null,"Row 421 (398)",null,66.383567019457175,null,24335.082920112382,null,243.35082920112382,null,null,-243.35082920112382,"LOSS",{"$f":"IF(COUNTA($F$6:$F$10)=5,(F422-F24)/F24,\"\")","v":1.4091732090911258},2,"middle",null,null,null,null,null,null,null,{"$f":"IF(AND(L421=\"WIN\",L422<>\"WIN\"),SUMIF(L$24:L421,\"WIN\",K$24:K421)-SUM(W$23:W420),\"\")","v":""},{"$f":"IF(AND(L421=\"LOSS\",L422<>\"LOSS\"),SUMIF(L$24:L421,\"LOSS\",K$24:K421)-SUM(X$23:X420),\"\")","v":""}]
[null,"Row 422 (399)",null,95.837513651838478,null,24091.732090911257,null,240.91732090911256,null,null,-240.91732090911256,"LOSS",{"$f":"IF(COUNTA($F$6:$F$10)=5,(F423-F24)/F24,\"\")","v":1.3850814770002144},3,"middle",null,null,null,null,null,null,null,{"$f":"IF(AND(L422=\"WIN\",L423<>\"WIN\"),SUMIF(L$24:L422,\"WIN\",K$24:K422)-SUM(W$23:W421),\"\")","v":""},{"$f":"IF(AND(L422=\"LOSS\",L423<>\"LOSS\"),SUMIF(L$24:L422,\"LOSS\",K$24:K422)-SUM(X$23:X421),\"\")","v":""}]
[null,"Row 423 (400)",null,81.411200869265727,null,23850.814770002144,null,238.50814770002145,null,null,-238.50814770002145,"LOSS",{"$f":"IF(COUNTA($F$6:$F$10)=5,(F424-F24)/F24,\"\")","v":1.3612306622302124},4,"middle",null,null,null,null,null,null,null,{"$f":"IF(AND(L423=\"WIN\",L424<>\"WIN\"),SUMIF(L$24:L423,\"WIN\",K$24:K423)-SUM(W$23:W422),\"\")","v":""},{"$f":"IF(AND(L423=\"LOSS\",L424<>\"LOSS\"),SUMIF(L$24:L423,\"LOSS\",K$24:K423)-SUM(X$23:X422),\"\")","v":""}]
[null,"Row 424 (401)",null,58.667250692710169,null,23612.306622302123,null,236.12306622302123,null,null,-236.12306622302123,"LOSS",{"$f":"IF(COUNTA($F$6:$F$10)=5,(F425-F24)/F24,\"\")","v":1.33761835560791},5,"middle",null,null,null,null,null,null,null,{"$f":"IF(AND(L424=\"WIN\",L425<>\"WIN\"),SUMIF(L$24:L424,\"WIN\",K$24:K424)-SUM(W$23:W423),\"\")","v":""},{"$f":"IF(AND(L424=\"LOSS\",L425<>\"LOSS\"),SUMIF(L$24:L424,\"LOSS\",K$24:K424)-SUM(X$23:X423),\"\")","v":""}]
[null,"Row 425 (402)",null,69.854588838913045,null,23376.183556079101,null,233.76183556079101,null,null,-233.76183556079101,"LOSS",{"$f":"IF(COUNTA($F$6:$F$10)=5,(F426-F24)/F24,\"\")","v":1.3142421720518309},6,"middle",null,null,null,null,null,null,null,{"$f":"IF(AND(L425=\"WIN\",L426<>\"WIN\"),SUMIF(L$24:L425,\"WIN\",K$24:K425)-SUM(W$23:W424),\"\")","v":""},{"$f":"IF(AND(L425=\"LOSS\",L426<>\"LOSS\"),SUMIF(L$24:L425,\"LOSS\",K$24:K425)-SUM(X$23:X424),\"\")","v":""}]
[null,"Row 426 (403)",null,69.351056349246861,null,23142.421720518309,null,231.42421720518308,null,null,-231.42421720518308,"LOSS",{"$f":"IF(COUNTA($F$6:$F$10)=5,(F427-F24)/F24,\"\")","v":1.2910997503313126},7,"middle",null,null,null,null,null,null,null,{"$f":"IF(AND(L426=\"WIN\",L427<>\"WIN\"),SUMIF(L$24:L426,\"WIN\",K$24:K426)-SUM(W$23:W425),\"\")","v":""},{"$f":"IF(AND(L426=\"LOSS\",L427<>\"LOSS\"),SUMIF(L$24:L426,\"LOSS\",K$24:K426)-SUM(X$23:X425),\"\")","v":""}]
[null,"Row 427 (404)",null,82.268735392899984,null,22910.997503313127,null,229.10997503313126,null,null,-229.10997503313126,"LOSS",{"$f":"IF(COUNTA($F$6:$F$10)=5,(F428-F24)/F24,\"\")","v":1.2681887528279996},8,"middle",null,null,null,null,null,null,null,{"$f":"IF(AND(L427=\"WIN\",L428<>\"WIN\"),SUMIF(L$24:L427,\"WIN\",K$24:K427)-SUM(W$23:W426),\"\")","v":""},{"$f":"IF(AND(L427=\"LOSS\",L428<>\"LOSS\"),SUMIF(L$24:L427,\"LOSS\",K$24:K427)-SUM(X$23:X426),\"\")","v":""}]
[null,"Row 428 (405)",null,71.985841895258631,null,22681.887528279996,null,226.81887528279998,null,null,-226.81887528279998,"LOSS",{"$f":"IF(COUNTA($F$6:$F$10)=5,(F429-F24)/F24,\"\")","v":1.2455068652997197},9,"middle",null,null,null,null,null,null,null,{"$f":"IF(AND(L428=\"WIN\",L429<>\"WIN\"),SUMIF(L$24:L428,\"WIN\",K$24:K428)-SUM(W$23:W427),\"\")","v":""},{"$f":"IF(AND(L428=\"LOSS\",L429<>\"LOSS\"),SUMIF(L$24:L428,\"LOSS\",K$24:K428)-SUM(X$23:X427),\"\")","v":""}]
[null,"Row 429 (406)",null,70.441208931650692,null,22455.068652997197,null,224.55068652997198,null,null,-224.55068652997198,"LOSS",{"$f":"IF(COUNTA($F$6:$F$10)=5,(F430-F24)/F24,\"\")","v":1.2230517966467225},10,"last",null,null,null,null,null,null,null,{"$f":"IF(AND(L429=\"WIN\",L430<>\"WIN\"),SUMIF(L$24:L429,\"WIN\",K$24:K429)-SUM(W$23:W428),\"\")","v":""},{"$f":"IF(AND(L429=\"LOSS\",L430<>\"LOSS\"),SUMIF(L$24:L429,\"LOSS\",K$24:K429)-SUM(X$23:X428),\"\")","v":-2350.3738720301299}]
[null,"Row 430 (407)",null,18.604890416763766,null,22230.517966467225,null,222.30517966467227,null,null,266.76621559760673,"WIN",{"$f":"IF(COUNTA($F$6:$F$10)=5,(F431-F24)/F24,\"\")","v":1.2497284182064832},1,"new",null,null,null,null,null,null,null,{"$f":"IF(AND(L430=\"WIN\",L431<>\"WIN\"),SUMIF(L$24:L430,\"WIN\",K$24:K430)-SUM(W$23:W429),\"\")","v":""},{"$f":"IF(AND(L430=\"LOSS\",L431<>\"LOSS\"),SUMIF(L$24:L430,\"LOSS\",K$24:K430)-SUM(X$23:X429),\"\")","v":""}]
[null,"Row 431 (408)",null,40.541098928792863,null,22497.284182064832,null,224.97284182064831,null,null,269.96741018477798,"WIN",{"$f":"IF(COUNTA($F$6:$F$10)=5,(F432-F24)/F24,\"\")","v":1.2767251592249609},2,"middle",null,null,null,null,null,null,null,{"$f":"IF(AND(L431=\"WIN\",L432<>\"WIN\"),SUMIF(L$24:L431,\"WIN\",K$24:K431)-SUM(W$23:W430),\"\")","v":""},{"$f":"IF(AND(L431=\"LOSS\",L432<>\"LOSS\"),SUMIF(L$24:L431,\"LOSS\",K$24:K431)-SUM(X$23:X430),\"\")","v":""}]
[null,"Row 432 (409)",null,10.693173259206269,null,22767.25159224961,null,227.6725159224961,null,null,273.20701910699529,"WIN",{"$f":"IF(COUNTA($F$6:$F$10)=5,(F433-F24)/F24,\"\")","v":1.3040458611356605},3,"middle",null,null,null,null,null,null,null,{"$f":"IF(AND(L432=\"WIN\",L433<>\"WIN\"),SUMIF(L$24:L432,\"WIN\",K$24:K432)-SUM(W$23:W431),\"\")","v":""},{"$f":"IF(AND(L432=\"LOSS\",L433<>\"LOSS\"),SUMIF(L$24:L432,\"LOSS\",K$24:K432)-SUM(X$23:X431),\"\")","v":""}]
[null,"Row 433 (410)",null,39.685135117729317,null,23040.458611356604,null,230.40458611356604,null,null,276.48550333627924,"WIN",{"$f":"IF(COUNTA($F$6:$F$10)=5,(F434-F24)/F24,\"\")","v":1.3316944114692884},4,"last",null,null,null,null,null,null,null,{"$f":"IF(AND(L433=\"WIN\",L434<>\"WIN\"),SUMIF(L$24:L433,\"WIN\",K$24:K433)-SUM(W$23:W432),\"\")","v":1086.4261482256552},{"$f":"IF(AND(L433=\"LOSS\",L434<>\"LOSS\"),SUMIF(L$24:L433,\"LOSS\",K$24:K433)-SUM(X$23:X432),\"\")","v":""}]
[null,"Row 434 (411)",null,91.179594716152423,null,23316.944114692884,null,233.16944114692885,null,null,-233.16944114692885,"LOSS",{"$f":"IF(COUNTA($F$6:$F$10)=5,(F435-F24)/F24,\"\")","v":1.3083774673545956},1,"new",null,null,null,null,null,null,null,{"$f":"IF(AND(L434=\"WIN\",L435<>\"WIN\"),SUMIF(L$24:L434,\"WIN\",K$24:K434)-SUM(W$23:W433),\"\")","v":""},{"$f":"IF(AND(L434=\"LOSS\",L435<>\"LOSS\"),SUMIF(L$24:L434,\"LOSS\",K$24:K434)-SUM(X$23:X433),\"\")","v":""}]
[null,"Row 435 (412)",null,96.612320177569089,null,23083.774673545955,null,230.83774673545955,null,null,-230.83774673545955,"LOSS",{"$f":"IF(COUNTA($F$6:$F$10)=5,(F436-F24)/F24,\"\")","v":1.2852936926810496},2,"middle",null,null,null,null,null,null,null,{"$f":"IF(AND(L435=\"WIN\",L436<>\"WIN\"),SUMIF(L$24:L435,\"WIN\",K$24:K435)-SUM(W$23:W434),\"\")","v":""},{"$f":"IF(AND(L435=\"LOSS\",L436<>\"LOSS\"),SUMIF(L$24:L435,\"LOSS\",K$24:K435)-SUM(X$23:X434),\"\")","v":""}]
[null,"Row 436 (413)",null,75.887981260695895,null,22852.936926810497,null,228.52936926810497,null,null,-228.52936926810497,"LOSS",{"$f":"IF(COUNTA($F$6:$F$10)=5,(F437-F24)/F24,\"\")","v":1.2624407557542392},3,"middle",null,null,null,null,null,null,null,{"$f":"IF(AND(L436=\"WIN\",L437<>\"WIN\"),SUMIF(L$24:L436,\"WIN\",K$24:K436)-SUM(W$23:W435),\"\")","v":""},{"$f":"IF(AND(L436=\"LOSS\",L437<>\"LOSS\"),SUMIF(L$24:L436,\"LOSS\",K$24:K436)-SUM(X$23:X435),\"\")","v":""}]
[null,"Row 437 (414)",null,79.423357845542554,null,22624.407557542392,null,226.24407557542392,null,null,-226.24407557542392,"LOSS",{"$f":"IF(COUNTA($F$6:$F$10)=5,(F438-F24)/F24,\"\")","v":1.2398163481966966},4,"last",null,null,null,null,null,null,null,{"$f":"IF(AND(L437=\"WIN\",L438<>\"WIN\"),SUMIF(L$24:L437,\"WIN\",K$24:K437)-SUM(W$23:W436),\"\")","v":""},{"$f":"IF(AND(L437=\"LOSS\",L438<>\"LOSS\"),SUMIF(L$24:L437,\"LOSS\",K$24:K437)-SUM(X$23:X436),\"\")","v":-918.7806327259168}]
[null,"Row 438 (415)",null,21.332486033199892,null,22398.163481966967,null,223.98163481966967,null,null,268.77796178360359,"WIN",{"$f":"IF(COUNTA($F$6:$F$10)=5,(F439-F24)/F24,\"\")","v":1.266694144375057},1,"last",null,null,null,null,null,null,null,{"$f":"IF(AND(L438=\"WIN\",L439<>\"WIN\"),SUMIF(L$24:L438,\"WIN\",K$24:K438)-SUM(W$23:W437),\"\")","v":268.77796178360586},{"$f":"IF(AND(L438=\"LOSS\",L439<>\"LOSS\"),SUMIF(L$24:L438,\"LOSS\",K$24:K438)-SUM(X$23:X437),\"\")","v":""}]
[null,"Row 439 (416)",null,90.241651643241894,null,22666.941443750569,null,226.66941443750571,null,null,-226.66941443750571,"LOSS",{"$f":"IF(COUNTA($F$6:$F$10)=5,(F440-F24)/F24,\"\")","v":1.2440272029313062},1,"new",null,null,null,null,null,null,null,{"$f":"IF(AND(L439=\"WIN\",L440<>\"WIN\"),SUMIF(L$24:L439,\"WIN\",K$24:K439)-SUM(W$23:W438),\"\")","v":""},{"$f":"IF(AND(L439=\"LOSS\",L440<>\"LOSS\"),SUMIF(L$24:L439,\"LOSS\",K$24:K439)-SUM(X$23:X438),\"\")","v":""}]
[null,"Row 440 (417)",null,67.752873978334122,null,22440.272029313062,null,224.40272029313064,null,null,-224.40272029313064,"LOSS",{"$f":"IF(COUNTA($F$6:$F$10)=5,(F441-F24)/F24,\"\")","v":1.2215869309019931},2,"last",null,null,null,null,null,null,null,{"$f":"IF(AND(L440=\"WIN\",L441<>\"WIN\"),SUMIF(L$24:L440,\"WIN\",K$24:K440)-SUM(W$23:W439),\"\")","v":""},{"$f":"IF(AND(L440=\"LOSS\",L441<>\"LOSS\"),SUMIF(L$24:L440,\"LOSS\",K$24:K440)-SUM(X$23:X439),\"\")","v":-451.07213473063894}]
[null,"Row 441 (418)",null,48.064701500734152,null,22215.86930901993,null,222.15869309019931,null,null,266.59043170823918,"WIN",{"$f":"IF(COUNTA($F$6:$F$10)=5,(F442-F24)/F24,\"\")","v":1.2482459740728169},1,"new",null,null,null,null,null,null,null,{"$f":"IF(AND(L441=\"WIN\",L442<>\"WIN\"),SUMIF(L$24:L441,\"WIN\",K$24:K441)-SUM(W$23:W440),\"\")","v":""},{"$f":"IF(AND(L441=\"LOSS\",L442<>\"LOSS\"),SUMIF(L$24:L441,\"LOSS\",K$24:K441)-SUM(X$23:X440),\"\")","v":""}]
[null,"Row 442 (419)",null,26.205615753871104,null,22482.459740728169,null,224.82459740728169,null,null,269.78951688873804,"WIN",{"$f":"IF(COUNTA($F$6:$F$10)=5,(F443-F24)/F24,\"\")","v":1.2752249257616906},2,"last",null,null,null,null,null,null,null,{"$f":"IF(AND(L442=\"WIN\",L443<>\"WIN\"),SUMIF(L$24:L442,\"WIN\",K$24:K442)-SUM(W$23:W441),\"\")","v":536.37994859697937},{"$f":"IF(AND(L442=\"LOSS\",L443<>\"LOSS\"),SUMIF(L$24:L442,\"LOSS\",K$24:K442)-SUM(X$23:X441),\"\")","v":""}]
[null,"Row 443 (420)",null,76.787946940849977,null,22752.249257616906,null,227.52249257616907,null,null,-227.52249257616907,"LOSS",{"$f":"IF(COUNTA($F$6:$F$10)=5,(F444-F24)/F24,\"\")","v":1.2524726765040737},1,"new",null,null,null,null,null,null,null,{"$f":"IF(AND(L443=\"WIN\",L444<>\"WIN\"),SUMIF(L$24:L443,\"WIN\",K$24:K443)-SUM(W$23:W442),\"\")","v":""},{"$f":"IF(AND(L443=\"LOSS\",L444<>\"LOSS\"),SUMIF(L$24:L443,\"LOSS\",K$24:K443)-SUM(X$23:X442),\"\")","v":""}]
[null,"Row 444 (421)",null,90.92840463034824,null,22524.726765040738,null,225.24726765040737,null,null,-225.24726765040737,"LOSS",{"$f":"IF(COUNTA($F$6:$F$10)=5,(F445-F24)/F24,\"\")","v":1.2299479497390331},2,"last",null,null,null,null,null,null,null,{"$f":"IF(AND(L444=\"WIN\",L445<>\"WIN\"),SUMIF(L$24:L444,\"WIN\",K$24:K444)-SUM(W$23:W443),\"\")","v":""},{"$f":"IF(AND(L444=\"LOSS\",L445<>\"LOSS\"),SUMIF(L$24:L444,\"LOSS\",K$24:K444)-SUM(X$23:X443),\"\")","v":-452.76976022657254}]
[null,"Row 445 (422)",null,45.726267505354656,null,22299.47949739033,null,222.99479497390331,null,null,267.59375396868398,"WIN",{"$f":"IF(COUNTA($F$6:$F$10)=5,(F446-F24)/F24,\"\")","v":1.2567073251359016},1,"last",null,null,null,null,null,null,null,{"$f":"IF(AND(L445=\"WIN\",L446<>\"WIN\"),SUMIF(L$24:L445,\"WIN\",K$24:K445)-SUM(W$23:W444),\"\")","v":267.59375396868563},{"$f":"IF(AND(L445=\"LOSS\",L446<>\"LOSS\"),SUMIF(L$24:L445,\"LOSS\",K$24:K445)-SUM(X$23:X444),\"\")","v":""}]
[null,"Row 446 (423)",null,79.519595272995772,null,22567.073251359016,null,225.67073251359017,null,null,-225.67073251359017,"LOSS",{"$f":"IF(COUNTA($F$6:$F$10)=5,(F447-F24)/F24,\"\")","v":1.2341402518845426},1,"new",null,null,null,null,null,null,null,{"$f":"IF(AND(L446=\"WIN\",L447<>\"WIN\"),SUMIF(L$24:L446,\"WIN\",K$24:K446)-SUM(W$23:W445),\"\")","v":""},{"$f":"IF(AND(L446=\"LOSS\",L447<>\"LOSS\"),SUMIF(L$24:L446,\"LOSS\",K$24:K446)-SUM(X$23:X445),\"\")","v":""}]
[null,"Row 447 (424)",null,92.91413281588585,null,22341.402518845425,null,223.41402518845425,null,null,-223.41402518845425,"LOSS",{"$f":"IF(COUNTA($F$6:$F$10)=5,(F448-F24)/F24,\"\")","v":1.2117988493656973},2,"last",null,null,null,null,null,null,null,{"$f":"IF(AND(L447=\"WIN\",L448<>\"WIN\"),SUMIF(L$24:L447,\"WIN\",K$24:K447)-SUM(W$23:W446),\"\")","v":""},{"$f":"IF(AND(L447=\"LOSS\",L448<>\"LOSS\"),SUMIF(L$24:L447,\"LOSS\",K$24:K447)-SUM(X$23:X446),\"\")","v":-449.0847577020395}]
[null,"Row 448 (425)",null,29.810357747395255,null,22117.988493656972,null,221.17988493656972,null,null,265.41586192388365,"WIN",{"$f":"IF(COUNTA($F$6:$F$10)=5,(F449-F24)/F24,\"\")","v":1.2383404355580856},1,"last",null,null,null,null,null,null,null,{"$f":"IF(AND(L448=\"WIN\",L449<>\"WIN\"),SUMIF(L$24:L448,\"WIN\",K$24:K448)-SUM(W$23:W447),\"\")","v":265.41586192388058},{"$f":"IF(AND(L448=\"LOSS\",L449<>\"LOSS\"),SUMIF(L$24:L448,\"LOSS\",K$24:K448)-SUM(X$23:X447),\"\")","v":""}]
[null,"Row 449 (426)",null,86.259141170571425,null,22383.404355580857,null,223.83404355580856,null,null,-223.83404355580856,"LOSS",{"$f":"IF(COUNTA($F$6:$F$10)=5,(F450-F24)/F24,\"\")","v":1.2159570312025048},1,"new",null,null,null,null,null,null,null,{"$f":"IF(AND(L449=\"WIN\",L450<>\"WIN\"),SUMIF(L$24:L449,\"WIN\",K$24:K449)-SUM(W$23:W448),\"\")","v":""},{"$f":"IF(AND(L449=\"LOSS\",L450<>\"LOSS\"),SUMIF(L$24:L449,\"LOSS\",K$24:K449)-SUM(X$23:X448),\"\")","v":""}]
[null,"Row 450 (427)",null,93.905643243349502,null,22159.570312025047,null,221.59570312025048,null,null,-221.59570312025048,"LOSS",{"$f":"IF(COUNTA($F$6:$F$10)=5,(F451-F24)/F24,\"\")","v":1.1937974608904796},2,"last",null,null,null,null,null,null,null,{"$f":"IF(AND(L450=\"WIN\",L451<>\"WIN\"),SUMIF(L$24:L450,\"WIN\",K$24:K450)-SUM(W$23:W449),\"\")","v":""},{"$f":"IF(AND(L450=\"LOSS\",L451<>\"LOSS\"),SUMIF(L$24:L450,\"LOSS\",K$24:K450)-SUM(X$23:X449),\"\")","v":-445.42974667605449}]
[null,"Row 451 (428)",null,51.11729677666932,null,21937.974608904795,null,219.37974608904796,null,null,263.25569530685755,"WIN",{"$f":"IF(COUNTA($F$6:$F$10)=5,(F452-F24)/F24,\"\")","v":1.220123030421165},1,"new",null,null,null,null,null,null,null,{"$f":"IF(AND(L451=\"WIN\",L452<>\"WIN\"),SUMIF(L$24:L451,\"WIN\",K$24:K451)-SUM(W$23:W450),\"\")","v":""},{"$f":"IF(AND(L451=\"LOSS\",L452<>\"LOSS\"),SUMIF(L$24:L451,\"LOSS\",K$24:K451)-SUM(X$23:X450),\"\")","v":""}]
[null,"Row 452 (429)",null,39.100759680711171,null,22201.230304211651,null,222.01230304211651,null,null,266.41476365053978,"WIN",{"$f":"IF(COUNTA($F$6:$F$10)=5,(F453-F24)/F24,\"\")","v":1.2467645067862192},2,"last",null,null,null,null,null,null,null,{"$f":"IF(AND(L452=\"WIN\",L453<>\"WIN\"),SUMIF(L$24:L452,\"WIN\",K$24:K452)-SUM(W$23:W451),\"\")","v":529.67045895739284},{"$f":"IF(AND(L452=\"LOSS\",L453<>\"LOSS\"),SUMIF(L$24:L452,\"LOSS\",K$24:K452)-SUM(X$23:X451),\"\")","v":""}]
[null,"Row 453 (430)",null,60.761216301452571,null,22467.645067862191,null,224.6764506786219,null,null,-224.6764506786219,"LOSS",{"$f":"IF(COUNTA($F$6:$F$10)=5,(F454-F24)/F24,\"\")","v":1.2242968617183572},1,"new",null,null,null,null,null,null,null,{"$f":"IF(AND(L453=\"WIN\",L454<>\"WIN\"),SUMIF(L$24:L453,\"WIN\",K$24:K453)-SUM(W$23:W452),\"\")","v":""},{"$f":"IF(AND(L453=\"LOSS\",L454<>\"LOSS\"),SUMIF(L$24:L453,\"LOSS\",K$24:K453)-SUM(X$23:X452),\"\")","v":""}]
[null,"Row 454 (431)",null,73.653263085419212,null,22242.968617183571,null,222.42968617183573,null,null,-222.42968617183573,"LOSS",{"$f":"IF(COUNTA($F$6:$F$10)=5,(F455-F24)/F24,\"\")","v":1.2020538931011735},2,"last",null,null,null,null,null,null,null,{"$f":"IF(AND(L454=\"WIN\",L455<>\"WIN\"),SUMIF(L$24:L454,\"WIN\",K$24:K454)-SUM(W$23:W453),\"\")","v":""},{"$f":"IF(AND(L454=\"LOSS\",L455<>\"LOSS\"),SUMIF(L$24:L454,\"LOSS\",K$24:K454)-SUM(X$23:X453),\"\")","v":-447.10613685045246}]
[null,"Row 455 (432)",null,35.732610181018821,null,22020.538931011735,null,220.20538931011737,null,null,264.24646717214085,"WIN",{"$f":"IF(COUNTA($F$6:$F$10)=5,(F456-F24)/F24,\"\")","v":1.2284785398183877},1,"last",null,null,null,null,null,null,null,{"$f":"IF(AND(L455=\"WIN\",L456<>\"WIN\"),SUMIF(L$24:L455,\"WIN\",K$24:K455)-SUM(W$23:W454),\"\")","v":264.24646717213909},{"$f":"IF(AND(L455=\"LOSS\",L456<>\"LOSS\"),SUMIF(L$24:L455,\"LOSS\",K$24:K455)-SUM(X$23:X454),\"\")","v":""}]
[null,"Row 456 (433)",null,90.015174620836419,null,22284.785398183878,null,222.8478539818388,null,null,-222.8478539818388,"LOSS",{"$f":"IF(COUNTA($F$6:$F$10)=5,(F457-F24)/F24,\"\")","v":1.2061937544202039},1,"last",null,null,null,null,null,null,null,{"$f":"IF(AND(L456=\"WIN\",L457<>\"WIN\"),SUMIF(L$24:L456,\"WIN\",K$24:K456)-SUM(W$23:W455),\"\")","v":""},{"$f":"IF(AND(L456=\"LOSS\",L457<>\"LOSS\"),SUMIF(L$24:L456,\"LOSS\",K$24:K456)-SUM(X$23:X455),\"\")","v":-222.84785398183885}]
[null,"Row 457 (434)",null,35.828715028208322,null,22061.937544202039,null,220.61937544202038,null,null,264.74325053042446,"WIN",{"$f":"IF(COUNTA($F$6:$F$10)=5,(F458-F24)/F24,\"\")","v":1.2326680794732463},1,"last",null,null,null,null,null,null,null,{"$f":"IF(AND(L457=\"WIN\",L458<>\"WIN\"),SUMIF(L$24:L457,\"WIN\",K$24:K457)-SUM(W$23:W456),\"\")","v":264.74325053042412},{"$f":"IF(AND(L457=\"LOSS\",L458<>\"LOSS\"),SUMIF(L$24:L457,\"LOSS\",K$24:K457)-SUM(X$23:X456),\"\")","v":""}]
[null,"Row 458 (435)",null,77.026514953431018,null,22326.680794732463,null,223.26680794732465,null,null,-223.26680794732465,"LOSS",{"$f":"IF(COUNTA($F$6:$F$10)=5,(F459-F24)/F24,\"\")","v":1.2103413986785136},1,"new",null,null,null,null,null,null,null,{"$f":"IF(AND(L458=\"WIN\",L459<>\"WIN\"),SUMIF(L$24:L458,\"WIN\",K$24:K458)-SUM(W$23:W457),\"\")","v":""},{"$f":"IF(AND(L458=\"LOSS\",L459<>\"LOSS\"),SUMIF(L$24:L458,\"LOSS\",K$24:K458)-SUM(X$23:X457),\"\")","v":""}]
[null,"Row 459 (436)",null,82.300263403158908,null,22103.413986785137,null,221.03413986785137,null,null,-221.03413986785137,"LOSS",{"$f":"IF(COUNTA($F$6:$F$10)=5,(F460-F24)/F24,\"\")","v":1.1882379846917288},2,"middle",null,null,null,null,null,null,null,{"$f":"IF(AND(L459=\"WIN\",L460<>\"WIN\"),SUMIF(L$24:L459,\"WIN\",K$24:K459)-SUM(W$23:W458),\"\")","v":""},{"$f":"IF(AND(L459=\"LOSS\",L460<>\"LOSS\"),SUMIF(L$24:L459,\"LOSS\",K$24:K459)-SUM(X$23:X458),\"\")","v":""}]
[null,"Row 460 (437)",null,87.773899488638676,null,21882.379846917287,null,218.82379846917289,null,null,-218.82379846917289,"LOSS",{"$f":"IF(COUNTA($F$6:$F$10)=5,(F461-F24)/F24,\"\")","v":1.1663556048448114},3,"last",null,null,null,null,null,null,null,{"$f":"IF(AND(L460=\"WIN\",L461<>\"WIN\"),SUMIF(L$24:L460,\"WIN\",K$24:K460)-SUM(W$23:W459),\"\")","v":""},{"$f":"IF(AND(L460=\"LOSS\",L461<>\"LOSS\"),SUMIF(L$24:L460,\"LOSS\",K$24:K460)-SUM(X$23:X459),\"\")","v":-663.12474628434575}]
[null,"Row 461 (438)",null,34.250169101986337,null,21663.556048448114,null,216.63556048448115,null,null,259.96267258137738,"WIN",{"$f":"IF(COUNTA($F$6:$F$10)=5,(F462-F24)/F24,\"\")","v":1.1923518721029489},1,"new",null,null,null,null,null,null,null,{"$f":"IF(AND(L461=\"WIN\",L462<>\"WIN\"),SUMIF(L$24:L461,\"WIN\",K$24:K461)-SUM(W$23:W460),\"\")","v":""},{"$f":"IF(AND(L461=\"LOSS\",L462<>\"LOSS\"),SUMIF(L$24:L461,\"LOSS\",K$24:K461)-SUM(X$23:X460),\"\")","v":""}]
[null,"Row 462 (439)",null,45.127807882906033,null,21923.51872102949,null,219.2351872102949,null,null,263.08222465235389,"WIN",{"$f":"IF(COUNTA($F$6:$F$10)=5,(F463-F24)/F24,\"\")","v":1.2186600945681842},2,"middle",null,null,null,null,null,null,null,{"$f":"IF(AND(L462=\"WIN\",L463<>\"WIN\"),SUMIF(L$24:L462,\"WIN\",K$24:K462)-SUM(W$23:W461),\"\")","v":""},{"$f":"IF(AND(L462=\"LOSS\",L463<>\"LOSS\"),SUMIF(L$24:L462,\"LOSS\",K$24:K462)-SUM(X$23:X461),\"\")","v":""}]
[null,"Row 463 (440)",null,50.48501672055616,null,22186.600945681843,null,221.86600945681843,null,null,266.2392113481821,"WIN",{"$f":"IF(COUNTA($F$6:$F$10)=5,(F464-F24)/F24,\"\")","v":1.2452840157030027},3,"middle",null,null,null,null,null,null,null,{"$f":"IF(AND(L463=\"WIN\",L464<>\"WIN\"),SUMIF(L$24:L463,\"WIN\",K$24:K463)-SUM(W$23:W462),\"\")","v":""},{"$f":"IF(AND(L463=\"LOSS\",L464<>\"LOSS\"),SUMIF(L$24:L463,\"LOSS\",K$24:K463)-SUM(X$23:X462),\"\")","v":""}]
[null,"Row 464 (441)",null,41.660581273577158,null,22452.840157030027,null,224.52840157030028,null,null,269.4340818843603,"WIN",{"$f":"IF(COUNTA($F$6:$F$10)=5,(F465-F24)/F24,\"\")","v":1.2722274238914386},4,"middle",null,null,null,null,null,null,null,{"$f":"IF(AND(L464=\"WIN\",L465<>\"WIN\"),SUMIF(L$24:L464,\"WIN\",K$24:K464)-SUM(W$23:W463),\"\")","v":""},{"$f":"IF(AND(L464=\"LOSS\",L465<>\"LOSS\"),SUMIF(L$24:L464,\"LOSS\",K$24:K464)-SUM(X$23:X463),\"\")","v":""}]
[null,"Row 465 (442)",null,39.535837361194481,null,22722.274238914386,null,227.22274238914386,null,null,272.66729086697262,"WIN",{"$f":"IF(COUNTA($F$6:$F$10)=5,(F466-F24)/F24,\"\")","v":1.2994941529781359},5,"last",null,null,null,null,null,null,null,{"$f":"IF(AND(L465=\"WIN\",L466<>\"WIN\"),SUMIF(L$24:L465,\"WIN\",K$24:K465)-SUM(W$23:W464),\"\")","v":1331.3854813332509},{"$f":"IF(AND(L465=\"LOSS\",L466<>\"LOSS\"),SUMIF(L$24:L465,\"LOSS\",K$24:K465)-SUM(X$23:X464),\"\")","v":""}]
[null,"Row 466 (443)",null,97.762898686783387,null,22994.941529781358,null,229.94941529781357,null,null,-229.94941529781357,"LOSS",{"$f":"IF(COUNTA($F$6:$F$10)=5,(F467-F24)/F24,\"\")","v":1.2764992114483542},1,"last",null,null,null,null,null,null,null,{"$f":"IF(AND(L466=\"WIN\",L467<>\"WIN\"),SUMIF(L$24:L466,\"WIN\",K$24:K466)-SUM(W$23:W465),\"\")","v":""},{"$f":"IF(AND(L466=\"LOSS\",L467<>\"LOSS\"),SUMIF(L$24:L466,\"LOSS\",K$24:K466)-SUM(X$23:X465),\"\")","v":-229.94941529781499}]
[null,"Row 467 (444)",null,54.263257487167635,null,22764.992114483543,null,227.64992114483542,null,null,273.17990537380251,"WIN",{"$f":"IF(COUNTA($F$6:$F$10)=5,(F468-F24)/F24,\"\")","v":1.3038172019857346},1,"last",null,null,null,null,null,null,null,{"$f":"IF(AND(L467=\"WIN\",L468<>\"WIN\"),SUMIF(L$24:L467,\"WIN\",K$24:K467)-SUM(W$23:W466),\"\")","v":273.17990537379956},{"$f":"IF(AND(L467=\"LOSS\",L468<>\"LOSS\"),SUMIF(L$24:L467,\"LOSS\",K$24:K467)-SUM(X$23:X466),\"\")","v":""}]
[null,"Row 468 (445)",null,73.44246286567359,null,23038.172019857346,null,230.38172019857348,null,null,-230.38172019857348,"LOSS",{"$f":"IF(COUNTA($F$6:$F$10)=5,(F469-F24)/F24,\"\")","v":1.2807790299658772},1,"new",null,null,null,null,null,null,null,{"$f":"IF(AND(L468=\"WIN\",L469<>\"WIN\"),SUMIF(L$24:L468,\"WIN\",K$24:K468)-SUM(W$23:W467),\"\")","v":""},{"$f":"IF(AND(L468=\"LOSS\",L469<>\"LOSS\"),SUMIF(L$24:L468,\"LOSS\",K$24:K468)-SUM(X$23:X467),\"\")","v":""}]
[null,"Row 469 (446)",null,96.383204088813656,null,22807.790299658773,null,228.07790299658774,null,null,-228.07790299658774,"LOSS",{"$f":"IF(COUNTA($F$6:$F$10)=5,(F470-F24)/F24,\"\")","v":1.2579712396662184},2,"last",null,null,null,null,null,null,null,{"$f":"IF(AND(L469=\"WIN\",L470<>\"WIN\"),SUMIF(L$24:L469,\"WIN\",K$24:K469)-SUM(W$23:W468),\"\")","v":""},{"$f":"IF(AND(L469=\"LOSS\",L470<>\"LOSS\"),SUMIF(L$24:L469,\"LOSS\",K$24:K469)-SUM(X$23:X468),\"\")","v":-458.4596231951582}]
[null,"Row 470 (447)",null,9.8447895772161296,null,22579.712396662184,null,225.79712396662185,null,null,270.9565487599462,"WIN",{"$f":"IF(COUNTA($F$6:$F$10)=5,(F471-F24)/F24,\"\")","v":1.285066894542213},1,"last",null,null,null,null,null,null,null,{"$f":"IF(AND(L470=\"WIN\",L471<>\"WIN\"),SUMIF(L$24:L470,\"WIN\",K$24:K470)-SUM(W$23:W469),\"\")","v":270.9565487599466},{"$f":"IF(AND(L470=\"LOSS\",L471<>\"LOSS\"),SUMIF(L$24:L470,\"LOSS\",K$24:K470)-SUM(X$23:X469),\"\")","v":""}]
[null,"Row 471 (448)",null,85.064552333918215,null,22850.66894542213,null,228.50668945422132,null,null,-228.50668945422132,"LOSS",{"$f":"IF(COUNTA($F$6:$F$10)=5,(F472-F24)/F24,\"\")","v":1.2622162255967908},1,"last",null,null,null,null,null,null,null,{"$f":"IF(AND(L471=\"WIN\",L472<>\"WIN\"),SUMIF(L$24:L471,\"WIN\",K$24:K471)-SUM(W$23:W470),\"\")","v":""},{"$f":"IF(AND(L471=\"LOSS\",L472<>\"LOSS\"),SUMIF(L$24:L471,\"LOSS\",K$24:K471)-SUM(X$23:X470),\"\")","v":-228.50668945421785}]
[null,"Row 472 (449)",null,40.822901447786094,null,22622.162255967909,null,226.2216225596791,null,null,271.46594707161489,"WIN",{"$f":"IF(COUNTA($F$6:$F$10)=5,(F473-F24)/F24,\"\")","v":1.2893628203039522},1,"new",null,null,null,null,null,null,null,{"$f":"IF(AND(L472=\"WIN\",L473<>\"WIN\"),SUMIF(L$24:L472,\"WIN\",K$24:K472)-SUM(W$23:W471),\"\")","v":""},{"$f":"IF(AND(L472=\"LOSS\",L473<>\"LOSS\"),SUMIF(L$24:L472,\"LOSS\",K$24:K472)-SUM(X$23:X471),\"\")","v":""}]
[null,"Row 473 (450)",null,{"$f":"IF(COUNTA($F$6:$F$10)=5,100*RAND(),\"\")","v":8.2484414278430336},null,22893.628203039523,null,{"$f":"IF(COUNTBLANK($F$6:$F$10),\"\",F473*$F$7)","v":228.93628203039523},null,null,274.72353843647426,{"$f":"IF(D473=\"\",\"\",IF(D473<$F$8,\"WIN\",\"LOSS\"))","v":"WIN"},{"$f":"IF(COUNTA($F$6:$F$10)=5,(F474-F24)/F24,\"\")","v":1.3168351741475999},{"$f":"IF(L473=L472,N472+1,1)","v":2},{"$f":"IF(N473=1,IF(N474=1,\"last\",\"new\"),IF(N474=1,\"last\",\"middle\"))","v":"middle"},null,null,null,null,null,null,null,{"$f":"IF(AND(L473=\"WIN\",L474<>\"WIN\"),SUMIF(L$24:L473,\"WIN\",K$24:K473)-SUM(W$23:W472),\"\")","v":""},{"$f":"IF(AND(L473=\"LOSS\",L474<>\"LOSS\"),SUMIF(L$24:L473,\"LOSS\",K$24:K473)-SUM(X$23:X472),\"\")","v":""}]
[null,"Row 474 (451)",null,0.56278740634926328,null,{"$f":"IF(COUNTBLANK($F$6:$F$10),\"\",IF(D473<$F$8,(1+$F$7*$F$9)*F473-$F$10,(1-$F$7)*F473-$F$10))","v":23168.351741475999},null,231.68351741475999,null,null,{"$f":"IF(COUNTBLANK($F$6:$F$10),\"\", IF(L474=\"win\", H474*$F$9-$F$10, IF(L474=\"loss\", -H474-$F$10)))","v":278.02022089771197},"WIN",{"$f":"IF(COUNTA($F$6:$F$10)=5,(F475-F24)/F24,\"\")","v":1.3446371962373713},3,"middle",null,null,null,null,null,null,null,{"$f":"IF(AND(L474=\"WIN\",L475<>\"WIN\"),SUMIF(L$24:L474,\"WIN\",K$24:K474)-SUM(W$23:W473),\"\")","v":""},{"$f":"IF(AND(L474=\"LOSS\",L475<>\"LOSS\"),SUMIF(L$24:L474,\"LOSS\",K$24:K474)-SUM(X$23:X473),\"\")","v":""}]
[null,"Row 475 (452)",null,35.135173311471981,null,23446.371962373712,null,234.46371962373712,null,null,281.35646354848456,"WIN",{"$f":"IF(COUNTA($F$6:$F$10)=5,(F476-F24)/F24,\"\")","v":1.3727728425922197},4,"middle",null,null,null,null,null,null,null,{"$f":"IF(AND(L475=\"WIN\",L476<>\"WIN\"),SUMIF(L$24:L475,\"WIN\",K$24:K475)-SUM(W$23:W474),\"\")","v":""},{"$f":"IF(AND(L475=\"LOSS\",L476<>\"LOSS\"),SUMIF(L$24:L475,\"LOSS\",K$24:K475)-SUM(X$23:X474),\"\")","v":""}]
[null,"Row 476 (453)",null,10.766635834125371,null,23727.728425922196,null,237.27728425922197,null,null,284.73274111106633,"WIN",{"$f":"IF(COUNTA($F$6:$F$10)=5,(F477-F24)/F24,\"\")","v":1.4012461167033263},5,"last",null,null,null,null,null,null,null,{"$f":"IF(AND(L476=\"WIN\",L477<>\"WIN\"),SUMIF(L$24:L476,\"WIN\",K$24:K476)-SUM(W$23:W475),\"\")","v":1390.298911065358},{"$f":"IF(AND(L476=\"LOSS\",L477<>\"LOSS\"),SUMIF(L$24:L476,\"LOSS\",K$24:K476)-SUM(X$23:X475),\"\")","v":""}]
[null,"Row 477 (454)",null,95.298160963758576,null,24012.461167033263,null,240.12461167033263,null,null,-240.12461167033263,"LOSS",{"$f":"IF(COUNTA($F$6:$F$10)=5,(F478-F24)/F24,\"\")","v":1.377233655536293},1,"last",null,null,null,null,null,null,null,{"$f":"IF(AND(L477=\"WIN\",L478<>\"WIN\"),SUMIF(L$24:L477,\"WIN\",K$24:K477)-SUM(W$23:W476),\"\")","v":""},{"$f":"IF(AND(L477=\"LOSS\",L478<>\"LOSS\"),SUMIF(L$24:L477,\"LOSS\",K$24:K477)-SUM(X$23:X476),\"\")","v":-240.12461167033325}]
[null,"Row 478 (455)",null,1.5550662614438715,null,23772.33655536293,null,237.72336555362929,null,null,285.26803866435512,"WIN",{"$f":"IF(COUNTA($F$6:$F$10)=5,(F479-F24)/F24,\"\")","v":1.4057604594027284},1,"new",null,null,null,null,null,null,null,{"$f":"IF(AND(L478=\"WIN\",L479<>\"WIN\"),SUMIF(L$24:L478,\"WIN\",K$24:K478)-SUM(W$23:W477),\"\")","v":""},{"$f":"IF(AND(L478=\"LOSS\",L479<>\"LOSS\"),SUMIF(L$24:L478,\"LOSS\",K$24:K478)-SUM(X$23:X477),\"\")","v":""}]
[null,"Row 479 (456)",null,27.271120524447333,null,24057.604594027285,null,240.57604594027285,null,null,288.69125512832738,"WIN",{"$f":"IF(COUNTA($F$6:$F$10)=5,(F480-F24)/F24,\"\")","v":1.4346295849155613},2,"middle",null,null,null,null,null,null,null,{"$f":"IF(AND(L479=\"WIN\",L480<>\"WIN\"),SUMIF(L$24:L479,\"WIN\",K$24:K479)-SUM(W$23:W478),\"\")","v":""},{"$f":"IF(AND(L479=\"LOSS\",L480<>\"LOSS\"),SUMIF(L$24:L479,\"LOSS\",K$24:K479)-SUM(X$23:X478),\"\")","v":""}]
[null,"Row 480 (457)",null,6.1127636479844654,null,24346.295849155613,null,243.46295849155612,null,null,292.15555018986731,"WIN",{"$f":"IF(COUNTA($F$6:$F$10)=5,(F481-F24)/F24,\"\")","v":1.4638451399345482},3,"middle",null,null,null,null,null,null,null,{"$f":"IF(AND(L480=\"WIN\",L481<>\"WIN\"),SUMIF(L$24:L480,\"WIN\",K$24:K480)-SUM(W$23:W479),\"\")","v":""},{"$f":"IF(AND(L480=\"LOSS\",L481<>\"LOSS\"),SUMIF(L$24:L480,\"LOSS\",K$24:K480)-SUM(X$23:X479),\"\")","v":""}]
[null,"Row 481 (458)",null,38.118040635337834,null,24638.451399345482,null,246.38451399345482,null,null,295.66141679214576,"WIN",{"$f":"IF(COUNTA($F$6:$F$10)=5,(F482-F24)/F24,\"\")","v":1.493411281613763},4,"middle",null,null,null,null,null,null,null,{"$f":"IF(AND(L481=\"WIN\",L482<>\"WIN\"),SUMIF(L$24:L481,\"WIN\",K$24:K481)-SUM(W$23:W480),\"\")","v":""},{"$f":"IF(AND(L481=\"LOSS\",L482<>\"LOSS\"),SUMIF(L$24:L481,\"LOSS\",K$24:K481)-SUM(X$23:X480),\"\")","v":""}]
[null,"Row 482 (459)",null,50.379049868916034,null,24934.112816137629,null,249.3411281613763,null,null,299.20935379365153,"WIN",{"$f":"IF(COUNTA($F$6:$F$10)=5,(F483-F24)/F24,\"\")","v":1.5233322169931283},5,"middle",null,null,null,null,null,null,null,{"$f":"IF(AND(L482=\"WIN\",L483<>\"WIN\"),SUMIF(L$24:L482,\"WIN\",K$24:K482)-SUM(W$23:W481),\"\")","v":""},{"$f":"IF(AND(L482=\"LOSS\",L483<>\"LOSS\"),SUMIF(L$24:L482,\"LOSS\",K$24:K482)-SUM(X$23:X481),\"\")","v":""}]
[null,"Row 483 (460)",null,32.544509269577603,null,25233.322169931282,null,252.33322169931282,null,null,302.79986603917536,"WIN",{"$f":"IF(COUNTA($F$6:$F$10)=5,(F484-F24)/F24,\"\")","v":1.5536122035970457},6,"middle",null,null,null,null,null,null,null,{"$f":"IF(AND(L483=\"WIN\",L484<>\"WIN\"),SUMIF(L$24:L483,\"WIN\",K$24:K483)-SUM(W$23:W482),\"\")","v":""},{"$f":"IF(AND(L483=\"LOSS\",L484<>\"LOSS\"),SUMIF(L$24:L483,\"LOSS\",K$24:K483)-SUM(X$23:X482),\"\")","v":""}]
[null,"Row 484 (461)",null,24.838759667073784,null,25536.122035970457,null,255.36122035970456,null,null,306.43346443164546,"WIN",{"$f":"IF(COUNTA($F$6:$F$10)=5,(F485-F24)/F24,\"\")","v":1.58425555004021},7,"last",null,null,null,null,null,null,null,{"$f":"IF(AND(L484=\"WIN\",L485<>\"WIN\"),SUMIF(L$24:L484,\"WIN\",K$24:K484)-SUM(W$23:W483),\"\")","v":2070.218945039167},{"$f":"IF(AND(L484=\"LOSS\",L485<>\"LOSS\"),SUMIF(L$24:L484,\"LOSS\",K$24:K484)-SUM(X$23:X483),\"\")","v":""}]
[null,"Row 485 (462)",null,65.99085498028478,null,25842.555500402101,null,258.42555500402102,null,null,-258.42555500402102,"LOSS",{"$f":"IF(COUNTA($F$6:$F$10)=5,(F486-F24)/F24,\"\")","v":1.558412994539808},1,"new",null,null,null,null,null,null,null,{"$f":"IF(AND(L485=\"WIN\",L486<>\"WIN\"),SUMIF(L$24:L485,\"WIN\",K$24:K485)-SUM(W$23:W484),\"\")","v":""},{"$f":"IF(AND(L485=\"LOSS\",L486<>\"LOSS\"),SUMIF(L$24:L485,\"LOSS\",K$24:K485)-SUM(X$23:X484),\"\")","v":""}]
[null,"Row 486 (463)",null,90.489018852972393,null,25584.129945398079,null,255.84129945398081,null,null,-255.84129945398081,"LOSS",{"$f":"IF(COUNTA($F$6:$F$10)=5,(F487-F24)/F24,\"\")","v":1.5328288645944099},2,"last",null,null,null,null,null,null,null,{"$f":"IF(AND(L486=\"WIN\",L487<>\"WIN\"),SUMIF(L$24:L486,\"WIN\",K$24:K486)-SUM(W$23:W485),\"\")","v":""},{"$f":"IF(AND(L486=\"LOSS\",L487<>\"LOSS\"),SUMIF(L$24:L486,\"LOSS\",K$24:K486)-SUM(X$23:X485),\"\")","v":-514.26685445800103}]
[null,"Row 487 (464)",null,26.526095940680882,null,25328.2886459441,null,253.28288645944102,null,null,303.93946375132919,"WIN",{"$f":"IF(COUNTA($F$6:$F$10)=5,(F488-F24)/F24,\"\")","v":1.5632228109695427},1,"new",null,null,null,null,null,null,null,{"$f":"IF(AND(L487=\"WIN\",L488<>\"WIN\"),SUMIF(L$24:L487,\"WIN\",K$24:K487)-SUM(W$23:W486),\"\")","v":""},{"$f":"IF(AND(L487=\"LOSS\",L488<>\"LOSS\"),SUMIF(L$24:L487,\"LOSS\",K$24:K487)-SUM(X$23:X486),\"\")","v":""}]
[null,"Row 488 (465)",null,1.9947447257498307,null,25632.228109695428,null,256.32228109695427,null,null,307.58673731634514,"WIN",{"$f":"IF(COUNTA($F$6:$F$10)=5,(F489-F24)/F24,\"\")","v":1.5939814847011773},2,"last",null,null,null,null,null,null,null,{"$f":"IF(AND(L488=\"WIN\",L489<>\"WIN\"),SUMIF(L$24:L488,\"WIN\",K$24:K488)-SUM(W$23:W487),\"\")","v":611.52620106767426},{"$f":"IF(AND(L488=\"LOSS\",L489<>\"LOSS\"),SUMIF(L$24:L488,\"LOSS\",K$24:K488)-SUM(X$23:X487),\"\")","v":""}]
[null,"Row 489 (466)",null,74.405965491826791,null,25939.814847011774,null,259.39814847011775,null,null,-259.39814847011775,"LOSS",{"$f":"IF(COUNTA($F$6:$F$10)=5,(F490-F24)/F24,\"\")","v":1.5680416698541655},1,"last",null,null,null,null,null,null,null,{"$f":"IF(AND(L489=\"WIN\",L490<>\"WIN\"),SUMIF(L$24:L489,\"WIN\",K$24:K489)-SUM(W$23:W488),\"\")","v":""},{"$f":"IF(AND(L489=\"LOSS\",L490<>\"LOSS\"),SUMIF(L$24:L489,\"LOSS\",K$24:K489)-SUM(X$23:X488),\"\")","v":-259.39814847011439}]
[null,"Row 490 (467)",null,37.024809318730703,null,25680.416698541656,null,256.80416698541654,null,null,308.16500038249984,"WIN",{"$f":"IF(COUNTA($F$6:$F$10)=5,(F491-F24)/F24,\"\")","v":1.5988581698924158},1,"last",null,null,null,null,null,null,null,{"$f":"IF(AND(L490=\"WIN\",L491<>\"WIN\"),SUMIF(L$24:L490,\"WIN\",K$24:K490)-SUM(W$23:W489),\"\")","v":308.16500038249796},{"$f":"IF(AND(L490=\"LOSS\",L491<>\"LOSS\"),SUMIF(L$24:L490,\"LOSS\",K$24:K490)-SUM(X$23:X489),\"\")","v":""}]
[null,"Row 491 (468)",null,82.734019974887403,null,25988.581698924158,null,259.88581698924156,null,null,-259.88581698924156,"LOSS",{"$f":"IF(COUNTA($F$6:$F$10)=5,(F492-F24)/F24,\"\")","v":1.5728695881934918},1,"last",null,null,null,null,null,null,null,{"$f":"IF(AND(L491=\"WIN\",L492<>\"WIN\"),SUMIF(L$24:L491,\"WIN\",K$24:K491)-SUM(W$23:W490),\"\")","v":""},{"$f":"IF(AND(L491=\"LOSS\",L492<>\"LOSS\"),SUMIF(L$24:L491,\"LOSS\",K$24:K491)-SUM(X$23:X490),\"\")","v":-259.88581698924099}]
[null,"Row 492 (469)",null,10.916881863383987,null,25728.695881934917,null,257.28695881934919,null,null,308.74435058321905,"WIN",{"$f":"IF(COUNTA($F$6:$F$10)=5,(F493-F24)/F24,\"\")","v":1.6037440232518136},1,"new",null,null,null,null,null,null,null,{"$f":"IF(AND(L492=\"WIN\",L493<>\"WIN\"),SUMIF(L$24:L492,\"WIN\",K$24:K492)-SUM(W$23:W491),\"\")","v":""},{"$f":"IF(AND(L492=\"LOSS\",L493<>\"LOSS\"),SUMIF(L$24:L492,\"LOSS\",K$24:K492)-SUM(X$23:X491),\"\")","v":""}]
[null,"Row 493 (470)",null,41.648531115805497,null,26037.440232518136,null,260.37440232518139,null,null,312.44928279021764,"WIN",{"$f":"IF(COUNTA($F$6:$F$10)=5,(F494-F24)/F24,\"\")","v":1.6349889515308353},2,"middle",null,null,null,null,null,null,null,{"$f":"IF(AND(L493=\"WIN\",L494<>\"WIN\"),SUMIF(L$24:L493,\"WIN\",K$24:K493)-SUM(W$23:W492),\"\")","v":""},{"$f":"IF(AND(L493=\"LOSS\",L494<>\"LOSS\"),SUMIF(L$24:L493,\"LOSS\",K$24:K493)-SUM(X$23:X492),\"\")","v":""}]
[null,"Row 494 (471)",null,14.114894412309386,null,26349.889515308354,null,263.49889515308354,null,null,316.19867418370023,"WIN",{"$f":"IF(COUNTA($F$6:$F$10)=5,(F495-F24)/F24,\"\")","v":1.6666088189492052},3,"last",null,null,null,null,null,null,null,{"$f":"IF(AND(L494=\"WIN\",L495<>\"WIN\"),SUMIF(L$24:L494,\"WIN\",K$24:K494)-SUM(W$23:W493),\"\")","v":937.39230755713652},{"$f":"IF(AND(L494=\"LOSS\",L495<>\"LOSS\"),SUMIF(L$24:L494,\"LOSS\",K$24:K494)-SUM(X$23:X493),\"\")","v":""}]
[null,"Row 495 (472)",null,64.353576958671383,null,26666.088189492053,null,266.66088189492052,null,null,-266.66088189492052,"LOSS",{"$f":"IF(COUNTA($F$6:$F$10)=5,(F496-F24)/F24,\"\")","v":1.6399427307597132},1,"new",null,null,null,null,null,null,null,{"$f":"IF(AND(L495=\"WIN\",L496<>\"WIN\"),SUMIF(L$24:L495,\"WIN\",K$24:K495)-SUM(W$23:W494),\"\")","v":""},{"$f":"IF(AND(L495=\"LOSS\",L496<>\"LOSS\"),SUMIF(L$24:L495,\"LOSS\",K$24:K495)-SUM(X$23:X494),\"\")","v":""}]
[null,"Row 496 (473)",null,95.395339508475772,null,26399.427307597132,null,263.99427307597131,null,null,-263.99427307597131,"LOSS",{"$f":"IF(COUNTA($F$6:$F$10)=5,(F497-F24)/F24,\"\")","v":1.6135433034521161},2,"last",null,null,null,null,null,null,null,{"$f":"IF(AND(L496=\"WIN\",L497<>\"WIN\"),SUMIF(L$24:L496,\"WIN\",K$24:K496)-SUM(W$23:W495),\"\")","v":""},{"$f":"IF(AND(L496=\"LOSS\",L497<>\"LOSS\"),SUMIF(L$24:L496,\"LOSS\",K$24:K496)-SUM(X$23:X495),\"\")","v":-530.65515497088927}]
[null,"Row 497 (474)",null,38.468858410184673,null,26135.43303452116,null,261.35433034521162,null,null,313.62519641425394,"WIN",{"$f":"IF(COUNTA($F$6:$F$10)=5,(F498-F24)/F24,\"\")","v":1.6449058230935414},1,"last",null,null,null,null,null,null,null,{"$f":"IF(AND(L497=\"WIN\",L498<>\"WIN\"),SUMIF(L$24:L497,\"WIN\",K$24:K497)-SUM(W$23:W496),\"\")","v":313.62519641425752},{"$f":"IF(AND(L497=\"LOSS\",L498<>\"LOSS\"),SUMIF(L$24:L497,\"LOSS\",K$24:K497)-SUM(X$23:X496),\"\")","v":""}]
[null,"Row 498 (475)",null,85.39532720139016,null,26449.058230935414,null,264.49058230935412,null,null,-264.49058230935412,"LOSS",{"$f":"IF(COUNTA($F$6:$F$10)=5,(F499-F24)/F24,\"\")","v":1.618456764862606},1,"new",null,null,null,null,null,null,null,{"$f":"IF(AND(L498=\"WIN\",L499<>\"WIN\"),SUMIF(L$24:L498,\"WIN\",K$24:K498)-SUM(W$23:W497),\"\")","v":""},{"$f":"IF(AND(L498=\"LOSS\",L499<>\"LOSS\"),SUMIF(L$24:L498,\"LOSS\",K$24:K498)-SUM(X$23:X497),\"\")","v":""}]
[null,"Row 499 (476)",null,59.575449707884822,null,26184.56764862606,null,261.84567648626063,null,null,-261.84567648626063,"LOSS",{"$f":"IF(COUNTA($F$6:$F$10)=5,(F500-F24)/F24,\"\")","v":1.5922721972139799},2,"last",null,null,null,null,null,null,null,{"$f":"IF(AND(L499=\"WIN\",L500<>\"WIN\"),SUMIF(L$24:L499,\"WIN\",K$24:K499)-SUM(W$23:W498),\"\")","v":""},{"$f":"IF(AND(L499=\"LOSS\",L500<>\"LOSS\"),SUMIF(L$24:L499,\"LOSS\",K$24:K499)-SUM(X$23:X498),\"\")","v":-526.33625879562169}]
[null,"Row 500 (477)",null,2.6709053063636357,null,25922.7219721398,null,259.227219721398,null,null,311.07266366567757,"WIN",{"$f":"IF(COUNTA($F$6:$F$10)=5,(F501-F24)/F24,\"\")","v":1.6233794635805476},1,"new",null,null,null,null,null,null,null,{"$f":"IF(AND(L500=\"WIN\",L501<>\"WIN\"),SUMIF(L$24:L500,\"WIN\",K$24:K500)-SUM(W$23:W499),\"\")","v":""},{"$f":"IF(AND(L500=\"LOSS\",L501<>\"LOSS\"),SUMIF(L$24:L500,\"LOSS\",K$24:K500)-SUM(X$23:X499),\"\")","v":""}]
[null,"Row 501 (478)",null,54.794330844047622,null,26233.794635805476,null,262.33794635805475,null,null,314.80553562966571,"WIN",{"$f":"IF(COUNTA($F$6:$F$10)=5,(F502-F24)/F24,\"\")","v":1.6548600171435142},2,"last",null,null,null,null,null,null,null,{"$f":"IF(AND(L501=\"WIN\",L502<>\"WIN\"),SUMIF(L$24:L501,\"WIN\",K$24:K501)-SUM(W$23:W500),\"\")","v":625.87819929534453},{"$f":"IF(AND(L501=\"LOSS\",L502<>\"LOSS\"),SUMIF(L$24:L501,\"LOSS\",K$24:K501)-SUM(X$23:X500),\"\")","v":""}]
[null,"Row 502 (479)",null,67.022745848627352,null,26548.600171435141,null,265.4860017143514,null,null,-265.4860017143514,"LOSS",{"$f":"IF(COUNTA($F$6:$F$10)=5,(F503-F24)/F24,\"\")","v":1.6283114169720789},1,"new",null,null,null,null,null,null,null,{"$f":"IF(AND(L502=\"WIN\",L503<>\"WIN\"),SUMIF(L$24:L502,\"WIN\",K$24:K502)-SUM(W$23:W501),\"\")","v":""},{"$f":"IF(AND(L502=\"LOSS\",L503<>\"LOSS\"),SUMIF(L$24:L502,\"LOSS\",K$24:K502)-SUM(X$23:X501),\"\")","v":""}]
[null,"Row 503 (480)",null,92.332345109591046,null,26283.11416972079,null,262.8311416972079,null,null,-262.8311416972079,"LOSS",{"$f":"IF(COUNTA($F$6:$F$10)=5,(F504-F24)/F24,\"\")","v":1.6020283028023583},2,"middle",null,null,null,null,null,null,null,{"$f":"IF(AND(L503=\"WIN\",L504<>\"WIN\"),SUMIF(L$24:L503,\"WIN\",K$24:K503)-SUM(W$23:W502),\"\")","v":""},{"$f":"IF(AND(L503=\"LOSS\",L504<>\"LOSS\"),SUMIF(L$24:L503,\"LOSS\",K$24:K503)-SUM(X$23:X502),\"\")","v":""}]
[null,"Row 504 (481)",null,95.455677439820207,null,26020.283028023583,null,260.20283028023584,null,null,-260.20283028023584,"LOSS",{"$f":"IF(COUNTA($F$6:$F$10)=5,(F505-F24)/F24,\"\")","v":1.5760080197743347},3,"last",null,null,null,null,null,null,null,{"$f":"IF(AND(L504=\"WIN\",L505<>\"WIN\"),SUMIF(L$24:L504,\"WIN\",K$24:K504)-SUM(W$23:W503),\"\")","v":""},{"$f":"IF(AND(L504=\"LOSS\",L505<>\"LOSS\"),SUMIF(L$24:L504,\"LOSS\",K$24:K504)-SUM(X$23:X503),\"\")","v":-788.51997369179298}]
[null,"Row 505 (482)",null,31.57825589292873,null,25760.080197743348,null,257.60080197743349,null,null,309.12096237292019,"WIN",{"$f":"IF(COUNTA($F$6:$F$10)=5,(F506-F24)/F24,\"\")","v":1.6069201160116267},1,"new",null,null,null,null,null,null,null,{"$f":"IF(AND(L505=\"WIN\",L506<>\"WIN\"),SUMIF(L$24:L505,\"WIN\",K$24:K505)-SUM(W$23:W504),\"\")","v":""},{"$f":"IF(AND(L505=\"LOSS\",L506<>\"LOSS\"),SUMIF(L$24:L505,\"LOSS\",K$24:K505)-SUM(X$23:X504),\"\")","v":""}]
[null,"Row 506 (483)",null,39.737226427558014,null,26069.201160116267,null,260.69201160116268,null,null,312.83041392139518,"WIN",{"$f":"IF(COUNTA($F$6:$F$10)=5,(F507-F24)/F24,\"\")","v":1.6382031574037661},2,"middle",null,null,null,null,null,null,null,{"$f":"IF(AND(L506=\"WIN\",L507<>\"WIN\"),SUMIF(L$24:L506,\"WIN\",K$24:K506)-SUM(W$23:W505),\"\")","v":""},{"$f":"IF(AND(L506=\"LOSS\",L507<>\"LOSS\"),SUMIF(L$24:L506,\"LOSS\",K$24:K506)-SUM(X$23:X505),\"\")","v":""}]
[null,"Row 507 (484)",null,39.791837509302297,null,26382.031574037661,null,263.8203157403766,null,null,316.58437888845191,"WIN",{"$f":"IF(COUNTA($F$6:$F$10)=5,(F508-F24)/F24,\"\")","v":1.6698615952926112},3,"last",null,null,null,null,null,null,null,{"$f":"IF(AND(L507=\"WIN\",L508<>\"WIN\"),SUMIF(L$24:L507,\"WIN\",K$24:K507)-SUM(W$23:W506),\"\")","v":938.53575518276921},{"$f":"IF(AND(L507=\"LOSS\",L508<>\"LOSS\"),SUMIF(L$24:L507,\"LOSS\",K$24:K507)-SUM(X$23:X506),\"\")","v":""}]
[null,"Row 508 (485)",null,84.413192254107429,null,26698.615952926113,null,266.98615952926116,null,null,-266.98615952926116,"LOSS",{"$f":"IF(COUNTA($F$6:$F$10)=5,(F509-F24)/F24,\"\")","v":1.6431629793396854},1,"new",null,null,null,null,null,null,null,{"$f":"IF(AND(L508=\"WIN\",L509<>\"WIN\"),SUMIF(L$24:L508,\"WIN\",K$24:K508)-SUM(W$23:W507),\"\")","v":""},{"$f":"IF(AND(L508=\"LOSS\",L509<>\"LOSS\"),SUMIF(L$24:L508,\"LOSS\",K$24:K508)-SUM(X$23:X507),\"\")","v":""}]
[null,"Row 509 (486)",null,59.084746348280468,null,26431.629793396853,null,264.31629793396854,null,null,-264.31629793396854,"LOSS",{"$f":"IF(COUNTA($F$6:$F$10)=5,(F510-F24)/F24,\"\")","v":1.6167313495462885},2,"middle",null,null,null,null,null,null,null,{"$f":"IF(AND(L509=\"WIN\",L510<>\"WIN\"),SUMIF(L$24:L509,\"WIN\",K$24:K509)-SUM(W$23:W508),\"\")","v":""},{"$f":"IF(AND(L509=\"LOSS\",L510<>\"LOSS\"),SUMIF(L$24:L509,\"LOSS\",K$24:K509)-SUM(X$23:X508),\"\")","v":""}]
[null,"Row 510 (487)",null,80.030473871365928,null,26167.313495462884,null,261.67313495462884,null,null,-261.67313495462884,"LOSS",{"$f":"IF(COUNTA($F$6:$F$10)=5,(F511-F24)/F24,\"\")","v":1.5905640360508255},3,"middle",null,null,null,null,null,null,null,{"$f":"IF(AND(L510=\"WIN\",L511<>\"WIN\"),SUMIF(L$24:L510,\"WIN\",K$24:K510)-SUM(W$23:W509),\"\")","v":""},{"$f":"IF(AND(L510=\"LOSS\",L511<>\"LOSS\"),SUMIF(L$24:L510,\"LOSS\",K$24:K510)-SUM(X$23:X509),\"\")","v":""}]
[null,"Row 511 (488)",null,56.86556494818781,null,25905.640360508256,null,259.05640360508255,null,null,-259.05640360508255,"LOSS",{"$f":"IF(COUNTA($F$6:$F$10)=5,(F512-F24)/F24,\"\")","v":1.5646583956903175},4,"middle",null,null,null,null,null,null,null,{"$f":"IF(AND(L511=\"WIN\",L512<>\"WIN\"),SUMIF(L$24:L511,\"WIN\",K$24:K511)-SUM(W$23:W510),\"\")","v":""},{"$f":"IF(AND(L511=\"LOSS\",L512<>\"LOSS\"),SUMIF(L$24:L511,\"LOSS\",K$24:K511)-SUM(X$23:X510),\"\")","v":""}]
[null,"Row 512 (489)",null,97.102914983191297,null,25646.583956903174,null,256.46583956903174,null,null,-256.46583956903174,"LOSS",{"$f":"IF(COUNTA($F$6:$F$10)=5,(F513-F24)/F24,\"\")","v":1.5390118117334144},5,"last",null,null,null,null,null,null,null,{"$f":"IF(AND(L512=\"WIN\",L513<>\"WIN\"),SUMIF(L$24:L512,\"WIN\",K$24:K512)-SUM(W$23:W511),\"\")","v":""},{"$f":"IF(AND(L512=\"LOSS\",L513<>\"LOSS\"),SUMIF(L$24:L512,\"LOSS\",K$24:K512)-SUM(X$23:X511),\"\")","v":-1308.4978355919811}]
[null,"Row 513 (490)",null,36.774579184279567,null,25390.118117334143,null,253.90118117334143,null,null,304.68141740800968,"WIN",{"$f":"IF(COUNTA($F$6:$F$10)=5,(F514-F24)/F24,\"\")","v":1.5694799534742152},1,"new",null,null,null,null,null,null,null,{"$f":"IF(AND(L513=\"WIN\",L514<>\"WIN\"),SUMIF(L$24:L513,\"WIN\",K$24:K513)-SUM(W$23:W512),\"\")","v":""},{"$f":"IF(AND(L513=\"LOSS\",L514<>\"LOSS\"),SUMIF(L$24:L513,\"LOSS\",K$24:K513)-SUM(X$23:X512),\"\")","v":""}]
[null,"Row 514 (491)",null,32.563538368564025,null,25694.799534742153,null,256.94799534742151,null,null,308.3375944169058,"WIN",{"$f":"IF(COUNTA($F$6:$F$10)=5,(F515-F24)/F24,\"\")","v":1.600313712915906},2,"last",null,null,null,null,null,null,null,{"$f":"IF(AND(L514=\"WIN\",L515<>\"WIN\"),SUMIF(L$24:L514,\"WIN\",K$24:K514)-SUM(W$23:W513),\"\")","v":613.01901182491565},{"$f":"IF(AND(L514=\"LOSS\",L515<>\"LOSS\"),SUMIF(L$24:L514,\"LOSS\",K$24:K514)-SUM(X$23:X513),\"\")","v":""}]
[null,"Row 515 (492)",null,86.791470852293102,null,26003.137129159059,null,260.03137129159057,null,null,-260.03137129159057,"LOSS",{"$f":"IF(COUNTA($F$6:$F$10)=5,(F516-F24)/F24,\"\")","v":1.5743105757867466},1,"new",null,null,null,null,null,null,null,{"$f":"IF(AND(L515=\"WIN\",L516<>\"WIN\"),SUMIF(L$24:L515,\"WIN\",K$24:K515)-SUM(W$23:W514),\"\")","v":""},{"$f":"IF(AND(L515=\"LOSS\",L516<>\"LOSS\"),SUMIF(L$24:L515,\"LOSS\",K$24:K515)-SUM(X$23:X514),\"\")","v":""}]
[null,"Row 516 (493)",null,91.675998383395054,null,25743.105757867466,null,257.43105757867465,null,null,-257.43105757867465,"LOSS",{"$f":"IF(COUNTA($F$6:$F$10)=5,(F517-F24)/F24,\"\")","v":1.548567470028879},2,"middle",null,null,null,null,null,null,null,{"$f":"IF(AND(L516=\"WIN\",L517<>\"WIN\"),SUMIF(L$24:L516,\"WIN\",K$24:K516)-SUM(W$23:W515),\"\")","v":""},{"$f":"IF(AND(L516=\"LOSS\",L517<>\"LOSS\"),SUMIF(L$24:L516,\"LOSS\",K$24:K516)-SUM(X$23:X515),\"\")","v":""}]
[null,"Row 517 (494)",null,94.824575028842801,null,25485.67470028879,null,254.85674700288791,null,null,-254.85674700288791,"LOSS",{"$f":"IF(COUNTA($F$6:$F$10)=5,(F518-F24)/F24,\"\")","v":1.5230817953285902},3,"last",null,null,null,null,null,null,null,{"$f":"IF(AND(L517=\"WIN\",L518<>\"WIN\"),SUMIF(L$24:L517,\"WIN\",K$24:K517)-SUM(W$23:W516),\"\")","v":""},{"$f":"IF(AND(L517=\"LOSS\",L518<>\"LOSS\"),SUMIF(L$24:L517,\"LOSS\",K$24:K517)-SUM(X$23:X516),\"\")","v":-772.3191758731482}]
[null,"Row 518 (495)",null,28.628671773288715,null,25230.817953285903,null,252.30817953285904,null,null,302.76981543943083,"WIN",{"$f":"IF(COUNTA($F$6:$F$10)=5,(F519-F24)/F24,\"\")","v":1.5533587768725334},1,"new",null,null,null,null,null,null,null,{"$f":"IF(AND(L518=\"WIN\",L519<>\"WIN\"),SUMIF(L$24:L518,\"WIN\",K$24:K518)-SUM(W$23:W517),\"\")","v":""},{"$f":"IF(AND(L518=\"LOSS\",L519<>\"LOSS\"),SUMIF(L$24:L518,\"LOSS\",K$24:K518)-SUM(X$23:X517),\"\")","v":""}]
[null,"Row 519 (496)",null,39.783397501701224,null,25533.587768725334,null,255.33587768725334,null,null,306.40305322470402,"WIN",{"$f":"IF(COUNTA($F$6:$F$10)=5,(F520-F24)/F24,\"\")","v":1.5839990821950038},2,"middle",null,null,null,null,null,null,null,{"$f":"IF(AND(L519=\"WIN\",L520<>\"WIN\"),SUMIF(L$24:L519,\"WIN\",K$24:K519)-SUM(W$23:W518),\"\")","v":""},{"$f":"IF(AND(L519=\"LOSS\",L520<>\"LOSS\"),SUMIF(L$24:L519,\"LOSS\",K$24:K519)-SUM(X$23:X518),\"\")","v":""}]
[null,"Row 520 (497)",null,22.610833914216578,null,25839.990821950039,null,258.39990821950039,null,null,310.07988986340047,"WIN",{"$f":"IF(COUNTA($F$6:$F$10)=5,(F521-F24)/F24,\"\")","v":1.6150070711813442},3,"last",null,null,null,null,null,null,null,{"$f":"IF(AND(L520=\"WIN\",L521<>\"WIN\"),SUMIF(L$24:L520,\"WIN\",K$24:K520)-SUM(W$23:W519),\"\")","v":919.25275852753839},{"$f":"IF(AND(L520=\"LOSS\",L521<>\"LOSS\"),SUMIF(L$24:L520,\"LOSS\",K$24:K520)-SUM(X$23:X519),\"\")","v":""}]
[null,"Row 521 (498)",null,72.081111215833999,null,26150.070711813441,null,261.50070711813441,null,null,-261.50070711813441,"LOSS",{"$f":"IF(COUNTA($F$6:$F$10)=5,(F522-F24)/F24,\"\")","v":1.5888570004695306},1,"new",null,null,null,null,null,null,null,{"$f":"IF(AND(L521=\"WIN\",L522<>\"WIN\"),SUMIF(L$24:L521,\"WIN\",K$24:K521)-SUM(W$23:W520),\"\")","v":""},{"$f":"IF(AND(L521=\"LOSS\",L522<>\"LOSS\"),SUMIF(L$24:L521,\"LOSS\",K$24:K521)-SUM(X$23:X520),\"\")","v":""}]
[null,"Row 522 (499)",null,90.09834360267196,null,25888.570004695306,null,258.88570004695305,null,null,-258.88570004695305,"LOSS",{"$f":"IF(COUNTA($F$6:$F$10)=5,(F523-F24)/F24,\"\")","v":1.5629684304648352},2,"last",null,null,null,null,null,null,null,{"$f":"IF(AND(L522=\"WIN\",L523<>\"WIN\"),SUMIF(L$24:L522,\"WIN\",K$24:K522)-SUM(W$23:W521),\"\")","v":""},{"$f":"IF(AND(L522=\"LOSS\",L523<>\"LOSS\"),SUMIF(L$24:L522,\"LOSS\",K$24:K522)-SUM(X$23:X521),\"\")","v":-520.38640716508235}]
[null,"Row 523 (500)",null,48.365227023887236,null,25629.684304648352,null,256.2968430464835,null,null,307.5562116557802,"WIN",{"$f":"IF(COUNTA($F$6:$F$10)=5,(F524-F24)/F24,\"\")","v":1.5937240516304132},1,"new",null,null,null,null,null,null,null,{"$f":"IF(AND(L523=\"WIN\",M524<>\"WIN\"),SUMIF(L$24:L523,\"WIN\",K$24:K523)-SUM(W$23:W522),\"\")","v":307.55621165577759},{"$f":"IF(AND(L523=\"LOSS\",M524<>\"LOSS\"),SUMIF(L$24:L523,\"LOSS\",K$24:K523)-SUM(X$23:X522),\"\")","v":""}]
[null,null,null,null,null,{"$f":"IF(COUNTBLANK($F$6:$F$10),\"\",IF(D523<$F$8,(1+$F$7*$F$9)*F523-$F$10,(1-$F$7)*F523-$F$10))","v":25937.240516304133}]

{"sheet":"Instruction & Quotations","index":2,"n_rows":59,"n_cols":25,"rows_kept":59,"cut":false,"hidden":false,"merged":[[1,24,1,28],[1,18,1,23],[53,19,54,26],[55,19,55,26],[45,19,45,26],[46,19,48,26],[49,19,50,26],[52,19,52,26],[1,3,1,10],[1,12,1,15],[51,3,51,15],[52,3,56,15],[4,1,58,1],[4,2,60,2],[56,19,56,23],[57,19,57,26],[4,28,58,28],[4,17,58,17],[4,12,6,15],[41,12,42,15],[57,3,57,15],[58,3,58,15],[56,24,56,26]]}
[]
[null,null,null,"Quotations",null,null,null,null,null,null,null,null,"Start Up Page",null,null,null,null,null,"Instructions - How To",null,null,null,null,null,"DayTradingLife.com"]
[]
[]
[null,null,null,"\"In Order To Win, You Must Expect To Win.\"",null,null,null,null,null,null,null,null,"For More Quotations, Please Visit: www.DayTradingLife.com"]
[null,null,null,"Richard Bach (1936-, American Author)"]
[]
[null,null,null,"Expect Victory And You Make Victory."]
[null,null,null,"Preston Bradley"]
[]
[null,null,null,"\"Life... It Tends To Respond To Our Outlook, To Shape"]
[null,null,null,"Itself To Meet Our Expectations.\""]
[null,null,null,"Richard M. DeVos"]
[null,null,null,"(1926-, American Businessman, Co-Founder Of Amway Corp.)"]
[]
[null,null,null,"\"Good Is Not Good, When Better Is Expected.\""]
[null,null,null,"Thomas Fuller (1608-1661, British Clergyman, Author)"]
[]
[null,null,null,"\"Persistent Prophecy Is A Familiar Way Of Assuring The Event.\""]
[null,null,null,"George Robert Gissing (1857-1903, British Novelist, Critic, Essayist)"]
[]
[null,null,null,"\"I Skate To Where The Puck Is Going To Be, Not Where It Is.\""]
[null,null,null,"Wayne Gretzky (1961-, Canadian Hockey Player)"]
[]
[null,null,null,"\"Life Is Largely A Matter Of Expectation.\""]
[null,null,null,"Horace (BC 65-8, Italian Poet)"]
[]
[null,null,null,"\"When You Expect Things To Happen -- Strangely Enough -- They Do Happen.\""]
[null,null,null,"John Pierpont Morgan (1837-1913, American Banker, Financier, Art Collector)"]
[]
[null,null,null,"\"What Is Destructive Is Impatience, Haste, Expecting Too Much Too Fast.\""]
[null,null,null,"May Sarton (1912-1995, American Poet, Novelist)"]
[]
[null,null,null,"\"Winner Expects To Win In Advance. Life Is A Self-Fulfilling Prophesy.\""]
[null,null,null,"Author Unknown"]
[]
[null,null,null,"\"Whatever We Expect With Confidence Becomes Our Own Self-Fulfilling Prophecy.\""]
[null,null,null,"Brian Tracy (1944-, Canadian-born American Trainer, Speaker, Author, Businessman)"]
[null,null,null,"Author's Website: www.briantracy.com"]
[]
[null,null,null,"\"Expect The Best, Plan For The Worst, And Prepare To Be Surprised.\""]
[null,null,null,"Denis Waitley (1933-, American Author, Speaker, Trainer, Peak Performance Expert)",null,null,null,null,null,null,null,null,"Click Start To Start :-)"]
[null,null,null,"Author's Website: www.deniswaitley.com"]
[]
[]
[null,null,null,"\"I Know Not Anything More Pleasant, Or More Instructive, Than To Compare",null,null,null,null,null,null,null,null,null,null,null,null,null,null,null,"Van Tharp's Expectancy "]
[null,null,null,"Experience With Expectation, Or To  Register From Time To Time The ",null,null,null,null,null,null,null,null,null,null,null,null,null,null,null,"Long Version: Expectancy? It Is Your Average Win Rate * Average Amount Won – Average Loss Rate * Average Amount Lost = Expectancy, Or; Your Average Expected Profit (Or Loss) Per Trade Taken."]
[null,null,null,"Difference Between Idea And Reality. It Is By This Kind Of Observation "]
[null,null,null,"That We  Grow Daily Less Liable To Be Disappointed.\""]
[null,null,null,"Samuel Johnson (1709-1784, British author)",null,null,null,null,null,null,null,null,null,null,null,null,null,null,null," Short Version: \"Expectancy Is Simply The Mean Or Average R-Multiple Generated.\""]
[]
[null,null,null,"EXPECTANCY"]
[null,null,null,"\"In The Real World Of Investing Or Trading, Expectancy Tells You The Net Profit Or Loss That You Can Expect Over A Large Number Of Single-Unit Trades. If The Total Amount Of Losing Trades Is Greater Than The Total Amount Of Winning Trades, Then You Are A Net Loser & Have A Negative Expectancy. If The Total Amount Of Winning Trades Is Greater Than The Total Amount Of Losing Trades, Then You Are A Net Winner & Have A Positive Expectancy.\"",null,null,null,null,null,null,null,null,null,null,null,null,null,null,null,"Distribution and Reprint Policy"]
[null,null,null,null,null,null,null,null,null,null,null,null,null,null,null,null,null,null,null,"This document maybe be republished & distributed under the proviso that it cannot be altered or amended In Anyway."]
[]
[null,null,null,null,null,null,null,null,null,null,null,null,null,null,null,null,null,null,null,"DayTradingLife.com Reserve all rights to this effect. "]
[null,null,null,null,null,null,null,null,null,null,null,null,null,null,null,null,null,null,null,"For any futher information please email me at: ",null,null,null,null,"traderdowboy@gmail.com"]
[null,null,null,"Dr. Van Tharp (Page 135 - Trade Your Way To Financial Freedom).",null,null,null,null,null,null,null,null,null,null,null,null,null,null,null,"Copyright © 2011-2012 - DayTradingLife.com. - All rights reserved."]
[null,null,null,"\"A Must Read, A Timeless Classic, By The 'Position Sizing' Master.\" - Dow-Boy"]

{"sheet":"Credits","index":3,"n_rows":0,"n_cols":0,"rows_kept":0,"cut":false,"hidden":false,"merged":[]}