{"text_format":"1","workbook":"xlsx","n_sheets":4,"sheets":["Splash","RandomORG Trading Simulator","Instruction & Quotations","Credits"],"not_rendered":{"charts":2,"images":18,"macros":1,"external_links":0,"defined_names":4,"comments":1,"pivot_tables":0},"unopened":[],"bounds":{"document_bytes":16777216,"sheet_cells":100000,"rows_first":2000,"rows_last":500,"rows_between":2000,"halvings":0,"cell_chars":16384,"cell_head_chars":4096},"cells_cut":0,"cells_raw":0,"read":"whole","date_system":"1900"}

{"sheet":"Splash","index":0,"n_rows":7,"n_cols":12,"rows_kept":7,"cut":false,"hidden":false,"merged":[[6,11,8,17]]}
[]
[]
[]
[]
[]
[]
[null,null,null,null,null,null,null,null,null,null,null,"DayTradingLife.com"]

{"sheet":"RandomORG Trading Simulator","index":1,"n_rows":524,"n_cols":39,"rows_kept":524,"cut":false,"hidden":false,"merged":[[1,37,1,39],[1,31,1,35],[13,3,13,4],[17,3,17,4],[14,3,14,4],[19,3,19,4],[15,3,16,4],[15,5,16,5],[12,2,12,5],[519,5,519,6],[520,5,520,6],[521,5,521,6],[502,5,502,6],[503,5,503,6],[504,5,504,6],[505,5,505,6],[506,5,506,6],[507,5,507,6],[508,5,508,6],[509,5,509,6],[510,5,510,6],[511,5,511,6],[512,5,512,6],[513,5,513,6],[514,5,514,6],[515,5,515,6],[516,5,516,6],[517,5,517,6],[518,5,518,6],[485,5,485,6],[486,5,486,6],[487,5,487,6],[467,5,467,6],[488,5,488,6],[489,5,489,6],[490,5,490,6],[491,5,491,6],[492,5,492,6],[493,5,493,6],[494,5,494,6],[495,5,495,6],[496,5,496,6],[497,5,497,6],[498,5,498,6],[499,5,499,6],[500,5,500,6],[501,5,501,6],[468,5,468,6],[469,5,469,6],[470,5,470,6],[471,5,471,6],[472,5,472,6],[473,5,473,6],[474,5,474,6],[475,5,475,6],[476,5,476,6],[477,5,477,6],[478,5,478,6],[479,5,479,6],[480,5,480,6],[481,5,481,6],[482,5,482,6],[483,5,483,6],[436,5,436,6],[437,5,437,6],[438,5,438,6],[439,5,439,6],[440,5,440,6],[441,5,441,6],[442,5,442,6],[443,5,443,6],[444,5,444,6],[445,5,445,6],[446,5,446,6],[447,5,447,6],[448,5,448,6],[449,5,449,6],[450,5,450,6],[484,5,484,6],[451,5,451,6],[452,5,452,6],[453,5,453,6],[454,5,454,6],[455,5,455,6],[456,5,456,6],[457,5,457,6],[458,5,458,6],[459,5,459,6],[460,5,460,6],[461,5,461,6],[462,5,462,6],[463,5,463,6],[464,5,464,6],[465,5,465,6],[466,5,466,6],[419,5,419,6],[420,5,420,6],[421,5,421,6],[422,5,422,6],[423,5,423,6],[424,5,424,6],[425,5,425,6],[426,5,426,6],[427,5,427,6],[428,5,428,6],[429,5,429,6],[430,5,430,6],[431,5,431,6],[432,5,432,6],[433,5,433,6],[434,5,434,6],[435,5,435,6],[402,5,402,6],[403,5,403,6],[404,5,404,6],[405,5,405,6],[406,5,406,6],[407,5,407,6],[408,5,408,6],[409,5,409,6],[410,5,410,6],[411,5,411,6],[412,5,412,6],[413,5,413,6],[414,5,414,6],[415,5,415,6],[416,5,416,6],[417,5,417,6],[418,5,418,6],[385,5,385,6],[386,5,386,6],[387,5,387,6],[388,5,388,6],[389,5,389,6],[390,5,390,6],[391,5,391,6],[392,5,392,6],[393,5,393,6],[394,5,394,6],[395,5,395,6],[396,5,396,6],[397,5,397,6],[398,5,398,6],[399,5,399,6],[400,5,400,6],[401,5,401,6],[368,5,368,6],[369,5,369,6],[370,5,370,6],[371,5,371,6],[372,5,372,6],[373,5,373,6],[374,5,374,6],[375,5,375,6],[376,5,376,6],[377,5,377,6],[378,5,378,6],[379,5,379,6],[380,5,380,6],[381,5,381,6],[382,5,382,6],[383,5,383,6],[384,5,384,6],[351,5,351,6],[352,5,352,6],[353,5,353,6],[354,5,354,6],[355,5,355,6],[356,5,356,6],[357,5,357,6],[358,5,358,6],[359,5,359,6],[360,5,360,6],[361,5,361,6],[362,5,362,6],[363,5,363,6],[364,5,364,6],[365,5,365,6],[366,5,366,6],[367,5,367,6],[334,5,334,6],[335,5,335,6],[336,5,336,6],[337,5,337,6],[338,5,338,6],[339,5,339,6],[340,5,340,6],[341,5,341,6],[342,5,342,6],[343,5,343,6],[344,5,344,6],[345,5,345,6],[346,5,346,6],[347,5,347,6],[348,5,348,6],[349,5,349,6],[350,5,350,6],[317,5,317,6],[318,5,318,6],[319,5,319,6],[320,5,320,6],[321,5,321,6],[322,5,322,6],[323,5,323,6],[324,5,324,6],[325,5,325,6],[326,5,326,6],[327,5,327,6],[328,5,328,6],[329,5,329,6],[330,5,330,6],[331,5,331,6],[332,5,332,6],[333,5,333,6],[300,5,300,6],[301,5,301,6],[302,5,302,6],[303,5,303,6],[304,5,304,6],[305,5,305,6],[306,5,306,6],[307,5,307,6],[308,5,308,6],[309,5,309,6],[310,5,310,6],[311,5,311,6],[312,5,312,6],[313,5,313,6],[314,5,314,6],[315,5,315,6],[316,5,316,6],[283,5,283,6],[284,5,284,6],[285,5,285,6],[286,5,286,6],[287,5,287,6],[288,5,288,6],[289,5,289,6],[290,5,290,6],[291,5,291,6],[292,5,292,6],[293,5,293,6],[294,5,294,6],[295,5,295,6],[296,5,296,6],[297,5,297,6],[298,5,298,6],[299,5,299,6],[266,5,266,6],[267,5,267,6],[268,5,268,6],[269,5,269,6],[270,5,270,6],[271,5,271,6],[272,5,272,6],[273,5,273,6],[274,5,274,6],[275,5,275,6],[276,5,276,6],[277,5,277,6],[278,5,278,6],[279,5,279,6],[280,5,280,6],[281,5,281,6],[282,5,282,6],[249,5,249,6],[250,5,250,6],[251,5,251,6],[252,5,252,6],[253,5,253,6],[254,5,254,6],[255,5,255,6],[256,5,256,6],[257,5,257,6],[258,5,258,6],[259,5,259,6],[260,5,260,6],[261,5,261,6],[262,5,262,6],[263,5,263,6],[264,5,264,6],[265,5,265,6],[232,5,232,6],[233,5,233,6],[234,5,234,6],[235,5,235,6],[236,5,236,6],[237,5,237,6],[238,5,238,6],[239,5,239,6],[240,5,240,6],[241,5,241,6],[242,5,242,6],[243,5,243,6],[244,5,244,6],[245,5,245,6],[246,5,246,6],[247,5,247,6],[248,5,248,6],[215,5,215,6],[216,5,216,6],[217,5,217,6],[218,5,218,6],[219,5,219,6],[220,5,220,6],[221,5,221,6],[222,5,222,6],[223,5,223,6],[224,5,224,6],[225,5,225,6],[226,5,226,6],[227,5,227,6],[228,5,228,6],[229,5,229,6],[230,5,230,6],[231,5,231,6],[198,5,198,6],[199,5,199,6],[200,5,200,6],[201,5,201,6],[202,5,202,6],[203,5,203,6],[204,5,204,6],[205,5,205,6],[206,5,206,6],[207,5,207,6],[208,5,208,6],[209,5,209,6],[210,5,210,6],[211,5,211,6],[212,5,212,6],[213,5,213,6],[214,5,214,6],[181,5,181,6],[182,5,182,6],[183,5,183,6],[184,5,184,6],[185,5,185,6],[186,5,186,6],[187,5,187,6],[188,5,188,6],[189,5,189,6],[190,5,190,6],[191,5,191,6],[192,5,192,6],[193,5,193,6],[194,5,194,6],[195,5,195,6],[196,5,196,6],[197,5,197,6],[164,5,164,6],[165,5,165,6],[166,5,166,6],[167,5,167,6],[168,5,168,6],[169,5,169,6],[170,5,170,6],[171,5,171,6],[172,5,172,6],[173,5,173,6],[174,5,174,6],[175,5,175,6],[176,5,176,6],[177,5,177,6],[178,5,178,6],[179,5,179,6],[180,5,180,6],[147,5,147,6],[148,5,148,6],[149,5,149,6],[150,5,150,6],[151,5,151,6],[152,5,152,6],[153,5,153,6],[154,5,154,6],[155,5,155,6],[156,5,156,6],[157,5,157,6],[158,5,158,6],[159,5,159,6],[160,5,160,6],[161,5,161,6],[162,5,162,6],[163,5,163,6],[130,5,130,6],[131,5,131,6],[132,5,132,6],[133,5,133,6],[134,5,134,6],[135,5,135,6],[136,5,136,6],[137,5,137,6],[138,5,138,6],[139,5,139,6],[140,5,140,6],[141,5,141,6],[142,5,142,6],[143,5,143,6],[144,5,144,6],[145,5,145,6],[146,5,146,6],[113,5,113,6],[114,5,114,6],[115,5,115,6],[116,5,116,6],[117,5,117,6],[118,5,118,6],[119,5,119,6],[120,5,120,6],[121,5,121,6],[122,5,122,6],[123,5,123,6],[124,5,124,6],[125,5,125,6],[126,5,126,6],[127,5,127,6],[128,5,128,6],[129,5,129,6],[96,5,96,6],[97,5,97,6],[98,5,98,6],[99,5,99,6],[100,5,100,6],[101,5,101,6],[102,5,102,6],[103,5,103,6],[104,5,104,6],[105,5,105,6],[106,5,106,6],[107,5,107,6],[108,5,108,6],[109,5,109,6],[110,5,110,6],[111,5,111,6],[112,5,112,6],[79,5,79,6],[80,5,80,6],[81,5,81,6],[82,5,82,6],[83,5,83,6],[84,5,84,6],[85,5,85,6],[86,5,86,6],[87,5,87,6],[88,5,88,6],[89,5,89,6],[90,5,90,6],[91,5,91,6],[92,5,92,6],[93,5,93,6],[94,5,94,6],[95,5,95,6],[4,2,4,3],[5,11,5,12],[11,9,12,10],[23,5,23,6],[24,5,24,6],[129,7,129,9],[130,7,130,9],[131,7,131,9],[132,7,132,9],[40,5,40,6],[41,5,41,6],[42,5,42,6],[43,5,43,6],[60,5,60,6],[61,5,61,6],[62,5,62,6],[63,5,63,6],[64,5,64,6],[65,5,65,6],[66,5,66,6],[67,5,67,6],[68,5,68,6],[69,5,69,6],[70,5,70,6],[71,5,71,6],[72,5,72,6],[73,5,73,6],[74,5,74,6],[75,5,75,6],[76,5,76,6],[77,5,77,6],[78,5,78,6],[516,7,516,9],[510,7,510,9],[511,7,511,9],[517,7,517,9],[518,7,518,9],[434,7,434,9],[512,7,512,9],[8,27,8,28],[431,7,431,9],[430,7,430,9],[383,7,383,9],[384,7,384,9],[385,7,385,9],[386,7,386,9],[387,7,387,9],[388,7,388,9],[389,7,389,9],[390,7,390,9],[391,7,391,9],[392,7,392,9],[393,7,393,9],[394,7,394,9],[395,7,395,9],[396,7,396,9],[506,7,506,9],[507,7,507,9],[508,7,508,9],[509,7,509,9],[513,7,513,9],[514,7,514,9],[515,7,515,9],[456,7,456,9],[500,7,500,9],[501,7,501,9],[502,7,502,9],[503,7,503,9],[504,7,504,9],[505,7,505,9],[437,7,437,9],[438,7,438,9],[439,7,439,9],[440,7,440,9],[441,7,441,9],[442,7,442,9],[443,7,443,9],[444,7,444,9],[445,7,445,9],[446,7,446,9],[447,7,447,9],[448,7,448,9],[449,7,449,9],[450,7,450,9],[480,7,480,9],[482,7,482,9],[485,7,485,9],[486,7,486,9],[487,7,487,9],[488,7,488,9],[471,7,471,9],[483,7,483,9],[484,7,484,9],[495,7,495,9],[130,25,130,39],[131,25,131,39],[496,7,496,9],[497,7,497,9],[132,25,132,39],[133,26,133,32],[134,25,134,39],[14,11,14,12],[14,9,14,10],[13,9,13,10],[14,25,14,26],[13,25,13,26],[11,25,12,26],[19,11,19,12],[17,27,17,28],[10,11,10,12],[3,32,3,37],[432,7,432,9],[433,7,433,9],[427,7,427,9],[428,7,428,9],[380,7,380,9],[381,7,381,9],[382,7,382,9],[429,7,429,9],[416,7,416,9],[397,7,397,9],[400,7,400,9],[401,7,401,9],[402,7,402,9],[403,7,403,9],[404,7,404,9],[520,7,520,9],[465,7,465,9],[466,7,466,9],[467,7,467,9],[468,7,468,9],[469,7,469,9],[470,7,470,9],[519,7,519,9],[472,7,472,9],[473,7,473,9],[474,7,474,9],[475,7,475,9],[476,7,476,9],[477,7,477,9],[478,7,478,9],[479,7,479,9],[451,7,451,9],[452,7,452,9],[453,7,453,9],[454,7,454,9],[455,7,455,9],[457,7,457,9],[458,7,458,9],[459,7,459,9],[460,7,460,9],[461,7,461,9],[464,7,464,9],[462,7,462,9],[463,7,463,9],[481,7,481,9],[498,7,498,9],[499,7,499,9],[405,7,405,9],[406,7,406,9],[407,7,407,9],[408,7,408,9],[409,7,409,9],[410,7,410,9],[411,7,411,9],[412,7,412,9],[426,7,426,9],[422,7,422,9],[423,7,423,9],[424,7,424,9],[425,7,425,9],[417,7,417,9],[418,7,418,9],[419,7,419,9],[420,7,420,9],[421,7,421,9],[413,7,413,9],[414,7,414,9],[415,7,415,9],[350,7,350,9],[351,7,351,9],[352,7,352,9],[353,7,353,9],[354,7,354,9],[355,7,355,9],[356,7,356,9],[357,7,357,9],[358,7,358,9],[359,7,359,9],[360,7,360,9],[361,7,361,9],[362,7,362,9],[398,7,398,9],[399,7,399,9],[363,7,363,9],[364,7,364,9],[365,7,365,9],[366,7,366,9],[367,7,367,9],[368,7,368,9],[369,7,369,9],[370,7,370,9],[371,7,371,9],[372,7,372,9],[373,7,373,9],[374,7,374,9],[375,7,375,9],[376,7,376,9],[377,7,377,9],[378,7,378,9],[379,7,379,9],[333,7,333,9],[334,7,334,9],[335,7,335,9],[336,7,336,9],[337,7,337,9],[338,7,338,9],[339,7,339,9],[340,7,340,9],[341,7,341,9],[342,7,342,9],[343,7,343,9],[344,7,344,9],[345,7,345,9],[346,7,346,9],[347,7,347,9],[348,7,348,9],[349,7,349,9],[316,7,316,9],[317,7,317,9],[318,7,318,9],[319,7,319,9],[320,7,320,9],[321,7,321,9],[322,7,322,9],[323,7,323,9],[324,7,324,9],[325,7,325,9],[326,7,326,9],[327,7,327,9],[328,7,328,9],[329,7,329,9],[330,7,330,9],[331,7,331,9],[332,7,332,9],[299,7,299,9],[300,7,300,9],[301,7,301,9],[302,7,302,9],[303,7,303,9],[304,7,304,9],[305,7,305,9],[306,7,306,9],[307,7,307,9],[308,7,308,9],[309,7,309,9],[310,7,310,9],[311,7,311,9],[312,7,312,9],[313,7,313,9],[314,7,314,9],[315,7,315,9],[282,7,282,9],[283,7,283,9],[284,7,284,9],[285,7,285,9],[286,7,286,9],[287,7,287,9],[288,7,288,9],[289,7,289,9],[290,7,290,9],[291,7,291,9],[292,7,292,9],[293,7,293,9],[294,7,294,9],[295,7,295,9],[296,7,296,9],[297,7,297,9],[298,7,298,9],[265,7,265,9],[266,7,266,9],[267,7,267,9],[268,7,268,9],[269,7,269,9],[270,7,270,9],[271,7,271,9],[272,7,272,9],[273,7,273,9],[274,7,274,9],[275,7,275,9],[276,7,276,9],[277,7,277,9],[278,7,278,9],[279,7,279,9],[280,7,280,9],[281,7,281,9],[248,7,248,9],[249,7,249,9],[250,7,250,9],[251,7,251,9],[252,7,252,9],[253,7,253,9],[254,7,254,9],[255,7,255,9],[256,7,256,9],[257,7,257,9],[258,7,258,9],[259,7,259,9],[260,7,260,9],[261,7,261,9],[262,7,262,9],[263,7,263,9],[264,7,264,9],[231,7,231,9],[232,7,232,9],[233,7,233,9],[234,7,234,9],[235,7,235,9],[236,7,236,9],[237,7,237,9],[238,7,238,9],[239,7,239,9],[240,7,240,9],[241,7,241,9],[242,7,242,9],[243,7,243,9],[244,7,244,9],[245,7,245,9],[246,7,246,9],[247,7,247,9],[214,7,214,9],[215,7,215,9],[216,7,216,9],[217,7,217,9],[218,7,218,9],[219,7,219,9],[220,7,220,9],[221,7,221,9],[222,7,222,9],[223,7,223,9],[224,7,224,9],[225,7,225,9],[226,7,226,9],[227,7,227,9],[228,7,228,9],[229,7,229,9],[230,7,230,9],[197,7,197,9],[198,7,198,9],[199,7,199,9],[200,7,200,9],[201,7,201,9],[202,7,202,9],[203,7,203,9],[204,7,204,9],[205,7,205,9],[206,7,206,9],[207,7,207,9],[208,7,208,9],[209,7,209,9],[210,7,210,9],[211,7,211,9],[212,7,212,9],[213,7,213,9],[180,7,180,9],[181,7,181,9],[182,7,182,9],[183,7,183,9],[184,7,184,9],[185,7,185,9],[186,7,186,9],[187,7,187,9],[188,7,188,9],[189,7,189,9],[190,7,190,9],[191,7,191,9],[192,7,192,9],[193,7,193,9],[194,7,194,9],[195,7,195,9],[196,7,196,9],[163,7,163,9],[164,7,164,9],[165,7,165,9],[166,7,166,9],[167,7,167,9],[168,7,168,9],[169,7,169,9],[170,7,170,9],[171,7,171,9],[172,7,172,9],[173,7,173,9],[174,7,174,9],[175,7,175,9],[176,7,176,9],[177,7,177,9],[178,7,178,9],[179,7,179,9],[146,7,146,9],[147,7,147,9],[148,7,148,9],[149,7,149,9],[150,7,150,9],[151,7,151,9],[152,7,152,9],[153,7,153,9],[154,7,154,9],[155,7,155,9],[156,7,156,9],[157,7,157,9],[158,7,158,9],[159,7,159,9],[160,7,160,9],[161,7,161,9],[162,7,162,9],[143,7,143,9],[144,7,144,9],[145,7,145,9],[112,7,112,9],[113,7,113,9],[114,7,114,9],[115,7,115,9],[116,7,116,9],[117,7,117,9],[118,7,118,9],[119,7,119,9],[120,7,120,9],[121,7,121,9],[122,7,122,9],[123,7,123,9],[124,7,124,9],[125,7,125,9],[126,7,126,9],[127,7,127,9],[128,7,128,9],[105,7,105,9],[106,7,106,9],[107,7,107,9],[108,7,108,9],[109,7,109,9],[110,7,110,9],[111,7,111,9],[133,7,133,9],[134,7,134,9],[135,7,135,9],[136,7,136,9],[137,7,137,9],[138,7,138,9],[139,7,139,9],[140,7,140,9],[141,7,141,9],[142,7,142,9],[60,7,60,9],[89,7,89,9],[90,7,90,9],[91,7,91,9],[92,7,92,9],[93,7,93,9],[94,7,94,9],[95,7,95,9],[96,7,96,9],[97,7,97,9],[98,7,98,9],[99,7,99,9],[100,7,100,9],[101,7,101,9],[102,7,102,9],[103,7,103,9],[104,7,104,9],[79,7,79,9],[80,7,80,9],[81,7,81,9],[82,7,82,9],[83,7,83,9],[84,7,84,9],[77,7,77,9],[78,7,78,9],[512,3,512,4],[513,3,513,4],[514,3,514,4],[515,3,515,4],[516,3,516,4],[517,3,517,4],[518,3,518,4],[519,3,519,4],[520,3,520,4],[521,3,521,4],[522,3,522,4],[23,7,23,9],[24,7,24,9],[25,7,25,9],[26,7,26,9],[27,7,27,9],[28,7,28,9],[29,7,29,9],[30,7,30,9],[31,7,31,9],[32,7,32,9],[33,7,33,9],[34,7,34,9],[35,7,35,9],[36,7,36,9],[37,7,37,9],[38,7,38,9],[39,7,39,9],[47,7,47,9],[48,7,48,9],[49,7,49,9],[50,7,50,9],[495,3,495,4],[496,3,496,4],[497,3,497,4],[498,3,498,4],[499,3,499,4],[500,3,500,4],[501,3,501,4],[502,3,502,4],[503,3,503,4],[504,3,504,4],[505,3,505,4],[506,3,506,4],[507,3,507,4],[508,3,508,4],[509,3,509,4],[510,3,510,4],[511,3,511,4],[478,3,478,4],[479,3,479,4],[480,3,480,4],[481,3,481,4],[482,3,482,4],[483,3,483,4],[484,3,484,4],[485,3,485,4],[486,3,486,4],[487,3,487,4],[488,3,488,4],[489,3,489,4],[490,3,490,4],[491,3,491,4],[492,3,492,4],[493,3,493,4],[494,3,494,4],[461,3,461,4],[462,3,462,4],[463,3,463,4],[464,3,464,4],[465,3,465,4]],"merged_total":2094,"flags":["merged_cut"]}
[]
[null,"Details",null,null,null,null,null,null,"Trade System Expectancy - 'Random.ORG'  Simulator v1.01",null,null,null,null,null,null,null,null,null,null,null,null,null,null,null,null,null,null,"DayTradingLife.com.",null,null,null,"traderdowboy@gmail.com",null,null,null,null,"Current Date / Time:",{"$f":"TEXT(NOW(),\"dd/mm/yyyy   hh:mm AM/PM\")","v":"13/07/2017   03:55 PM"}]
[]
[null,null,"1st: ENTER DETAILS IN YELLOW CELLS!",null,null,null,null,null,null,"Results After  500  Random Trades.",null,null,null,null,null,null,null,null,null,null,null,null,null,null,null,null,null,null,null,null,null,null,"Results After 100 Simulated Trades"]
[null,null,"NOTES",null,"CALCULATE",null,null,null,null,"Total Losing Trades",null,{"$f":"IF(COUNTA($F$6:$F$10)=5,COUNTIF($L$24:$L$523,\"LOSS\"),\"\")","v":230},null,null,null,null,null,null,null,null,null,null,null,null,null,"Total Winning Trades",null,{"$f":"IF(COUNTA($F$6:$F$10)=5,COUNTIF($L$24:$L$523,\"WIN\"),\"\")","v":270},null,null,null,null,"Total Losing Trades",{"$f":"IF(COUNTA($F$6:$F$10)=5,COUNTIF($L$24:$L$123,\"LOSS\"),\"\")","v":41},null,null,"Total Winning Trades",{"$f":"IF(COUNTA($F$6:$F$10)=5,COUNTIF($L$24:$L$123,\"WIN\"),\"\")","v":59}]
[null,null,"Starting Capital (£)",null,null,10000,null,null,null,"Total Losses(£)",null,{"$f":"IF(COUNTA($F$6:$F$10)=5,SUMPRODUCT((L24:L523=\"LOSS\")*((F25:F524)-(F24:F523)))-F10,\"\")","v":-35691.470492521279},null,null,null,null,null,null,null,null,null,null,null,null,null,"Total Wins(£)",null,{"$f":"IF(COUNTA($F$6:$F$10)=5,SUMPRODUCT((L24:L523=\"WIN\")*((F25:F524)-(F24:F523)))-F10,\"\")","v":50513.262574523163},null,null,null,null,"Total Losses(£)",{"$f":"IF(COUNTA($F$6:$F$10)=5,SUMPRODUCT((L24:L123=\"LOSS\")*((F25:F124)-(F24:F123)))-F10,\"\")","v":-5001.51229289408},null,null,"Total Wins(£)",{"$f":"IF(COUNTA($F$6:$F$10)=5,SUMPRODUCT((L24:L123=\"WIN\")*((F25:F124)-(F24:F123)))-F10,\"\")","v":8388.8190896069154}]
[null,null,"Risk (%)",null,null,0.01,null,null,null,"Actual Losing(%)",null,{"$f":"IF(COUNTA($F$6:$F$10)=5,L5/(L5+AB5),\"\")","v":0.46},null,null,null,null,null,null,null,null,null,null,null,null,null,"Actual Win(%)",null,{"$f":"IF(COUNTA($F$6:$F$10)=5,(COUNTIF($D$24:$D$523,\"<\" & $F$8)/500),\"\")","v":0.54},null,null,null,null,"Actual Losing(%)",{"$f":"IF(COUNTA($F$6:$F$10)=5,AH5/(AH5+AL5),\"\")","v":0.41},null,null,"Actual Winning(%)",{"$f":"IF(COUNTA($F$6:$F$10)=5,(COUNTIF($D$24:$D$123,\"<\" & $F$8)/100),\"\")","v":0.59}]
[null,null,"Winning  (%)",null,null,55,null,null,null,"Average Trade Loss(£)",null,{"$f":"IF(COUNTA($F$6:$F$10)=5,(L6/L5),\"\")","v":-155.18030648922294},null,null,null,null,null,null,null,null,null,null,null,null,null,"Average Trade Win(£)",null,{"$f":"IF(COUNTA($F$6:$F$10)=5,(AB6/AB5),\"\")","v":187.08615768341912},null,null,null,null,"Average Trade Loss(£)",{"$f":"IF(COUNTA($F$6:$F$10)=5,(AH6/AH5),\"\")","v":-121.98810470473366},null,null,"Average Trade Win(£)",{"$f":"IF(COUNTA($F$6:$F$10)=5,(AL6/AL5),\"\")","v":142.1833744001172}]
[null,null,"Payoff Ratio OR R/R",null,null,1.2,null,null,null,"Average Trade Loss(%)",null,{"$f":"IF(COUNTA($F$6:$F$10)=5,(L8/L6),\"\")","v":4.3478260869565218E-3},null,null,null,null,null,null,null,null,null,null,null,null,null,"Average Trade Win(%)",null,{"$f":"IF(COUNTA($F$6:$F$10)=5,(AB8/AB6),\"\")","v":3.7037037037037034E-3},null,null,null,null,"Average Trade Loss(%)",{"$f":"IF(COUNTA($F$6:$F$10)=5,(AH8/AH6),\"\")","v":2.4390243902439025E-2},null,null,"Average Trade Win(%)",{"$f":"IF(COUNTA($F$6:$F$10)=5,(AL8/AL6),\"\")","v":1.6949152542372881E-2}]
[null,null,"Commission (£)",null,null,0,null,null,null,"Most Consec. Losses",null,{"$f":"IF(COUNTA($F$6:$F$10)=5,MAX(FREQUENCY(IF(L24:L523=\"LOSS\",ROW(L24:L523)),IF(L24:L523<>\"LOSS\",ROW(L24:L523)))),\"\")","v":7},{"$f":"IF(N(L10),ADDRESS(MATCH(L10,COUNTIF(OFFSET(L24:L523,ROW(INDIRECT(\"1:\"&ROWS(L24:L523)-L10+1))-1,0,L10),\"LOSS\"),0)+ROW(L24)-1,COLUMN(L24),4)&\":\"&ADDRESS(MATCH(L10,COUNTIF(OFFSET(L24:L523,ROW(INDIRECT(\"1:\"&ROWS(L24:L523)-L10+1))-1,0,L10),\"LOSS\"),0)+L10-1+ROW(L24)-1,COLUMN(L24),4),\"\")","v":"L192:L198"},null,null,null,null,null,null,null,null,null,null,null,null,"Most Consec. Wins",null,{"$f":"IF(COUNTA($F$6:$F$10)=5,MAX(FREQUENCY(IF(L24:L523=\"WIN\",ROW(L24:L523)),IF(L24:L523<>\"WIN\",ROW(L24:L523)))),\"\")","v":9},{"$f":"IF(N(AB10),ADDRESS(MATCH(AB10,COUNTIF(OFFSET(L24:L523,ROW(INDIRECT(\"1:\"&ROWS(L24:L523)-AB10+1))-1,0,AB10),\"WIN\"),0)+ROW(L24)-1,COLUMN(L24),4)&\":\"&ADDRESS(MATCH(AB10,COUNTIF(OFFSET(L24:L523,ROW(INDIRECT(\"1:\"&ROWS(L24:L523)-AB10+1))-1,0,AB10),\"WIN\"),0)+AB10-1+ROW(L24)-1,COLUMN(L24),4),\"\")","v":"L318:L326"},null,null," ","Most Consec. Losses",{"$f":"IF(COUNTA($F$6:$F$10)=5,MAX(FREQUENCY(IF(L24:L123=\"LOSS\",ROW(L24:L123)),IF(L24:L124<>\"LOSS\",ROW(L24:L123)))),\"\")","v":4},{"$f":"IF(N(AH10),ADDRESS(MATCH(AH10,COUNTIF(OFFSET(L24:L123,ROW(INDIRECT(\"1:\"&ROWS(L24:L123)-AH10+1))-1,0,AH10),\"LOSS\"),0)+ROW(L24)-1,COLUMN(L24),4)&\":\"&ADDRESS(MATCH(AH10,COUNTIF(OFFSET(L24:L123,ROW(INDIRECT(\"1:\"&ROWS(L24:L123)-AH10+1))-1,0,AH10),\"LOSS\"),0)+AH10-1+ROW(L24)-1,COLUMN(L24),4),\"\")","v":"L96:L99"},null,"Most Consec. Wins",{"$f":"IF(COUNTA($F$6:$F$10)=5,MAX(FREQUENCY(IF(L24:L123=\"WIN\",ROW(L24:L123)),IF(L24:L123<>\"WIN\",ROW(L24:L123)))),\"\")","v":7},{"$f":"IF(N(AL10),ADDRESS(MATCH(AL10,COUNTIF(OFFSET(L24:L123,ROW(INDIRECT(\"1:\"&ROWS(L24:L123)-AL10+1))-1,0,AL10),\"WIN\"),0)+ROW(L24)-1,COLUMN(L24),4)&\":\"&ADDRESS(MATCH(AL10,COUNTIF(OFFSET(L24:L123,ROW(INDIRECT(\"1:\"&ROWS(L24:L123)-AL10+1))-1,0,AL10),\"WIN\"),0)+AL10-1+ROW(L24)-1,COLUMN(L24),4),\"\")","v":"L47:L53"}]
[null,null,null,null,null,null,null,null,null,"Most Consec. Losses(£)",null,{"$f":"IF(COUNTA($F$6:$F$10)=5,SUM(OFFSET(INDIRECT(M10),,-1,L10)),\"\")","v":-990.97781307576224},null,null,null,null,null,null,null,null,null,null,null,null,null,"Most Consec. Wins(£)",null,{"$f":"IF(COUNTA($F$6:$F$10)=5,SUM(OFFSET(INDIRECT(AC10),,-1,AB10)),\"\")","v":1595.499491538538},null,null,null,null,"Most Consec. Losses(£)",{"$f":"IF(COUNTA($F$6:$F$10)=5,SUM(OFFSET(INDIRECT(AI10),,-1,AH10)),\"\")","v":-513.82297221512385},null,null,"Most Consec. Wins(£)",{"$f":"IF(COUNTA($F$6:$F$10)=5,SUM(OFFSET(INDIRECT(AM10),,-1,AL10)),\"\")","v":961.02271480021955}]
[null,null,null,null,null,null,null,null,null,"Largest Losing Streak(£)",null,{"$f":"IF(COUNTA($F$6:$F$10)=5,MIN(X24:X523),\"\")","v":-990.97781307576224},null,null,null,null,null,null,null,null,null,null,null,null,null,"Largest Winning Streak(£)",null,{"$f":"IF(COUNTA($F$6:$F$10)=5,MAX(W24:W523),\"\")","v":1889.251073004496},null,null,null,null,"Largest Losing Streak(£)",{"$f":"IF(COUNTA($F$6:$F$10)=5,MIN(X24:X123),\"\")","v":-513.82297221512408},null,null,"Largest Winning Streak(£)",{"$f":"IF(COUNTA($F$6:$F$10)=5,MAX(W24:W123),\"\")","v":961.02271480021955}]
[null,null,"Statistical Probabilty Of Consec. Wins & Losses."]
[null,null,"No.Trades","Con.Losses",null,"Con. Wins",null,null,null,"Largest Losing Trade(£)",null,{"$f":"IF(M14=\"\",\"\",\"K\"& 23+MATCH(M14,IF(L24:L523=\"LOSS\",K24:K523),0))","v":"K515"},{"$f":"IF(COUNTA($F$6:$F$10)<5, \"\", MIN(IF(L24:L523 = \"LOSS\", K24:K523)))","v":-248.84854766799268},null,null,null,null,null,null,null,null,null,null,null,null,"Largest Winning Trade(£)",null,{"$f":"IF(AC14=\"\",\"\",\"K\"& 23+MATCH(AC14,IF(L24:L523=\"WIN\",K24:K523),0))","v":"K514"},{"$f":"IF(COUNTA($F$6:$F$10)<5, \"\", MAX(IF(L24:L523 = \"WIN\", K24:K523)))","v":295.07732925058423},null,null,null,"Largest Losing Trade(£)",{"$f":"IF(AI14=\"\",\"\",\"K\"& 23+MATCH(AI14,IF(L24:L123=\"LOSS\",K24:K123),0))","v":"K120"},{"$f":"IF(COUNTA($F$6:$F$10)<5, \"\", MIN(IF(L24:L123 = \"LOSS\", K24:K123)))","v":-136.33492385720655},null,"Largest Winning Trade(£)",{"$f":"IF(AM14=\"\",\"\",\"K\"& 23+MATCH(AM14,IF(L24:L123=\"WIN\",K24:K123),0))","v":"K119"},{"$f":"IF(COUNTA($F$6:$F$10)<5, \"\", MAX(IF(L24:L123 = \"WIN\", K24:K123)))","v":161.66196504807098}]
[null,null,null,{"$f":"IF(COUNTA($C$15,$F$8)=2,LN(C15)/-LN(D16),\"\")","v":""},null,{"$f":"IF(COUNTA($C$15,$F$8)=2,LN(C15)/-LN(F16),\"\")","v":""},null,null,null,"Lowest Equity Low(£)",null,{"$f":"IF(COUNTA($F$6:$F$10)=5,MIN($F$24:$F$523),\"\")","v":9856.3816270876287},null,null,null,null,null,null,null,null,null,null,null,null,null,"Peak Gain(£)",null,{"$f":"IF(COUNTA($F$6:$F$10)=5,MAX($F$24:$F$523),\"\")","v":24884.854766799268},null,null,null,null,"Lowest Equity Low(£)",{"$f":"IF(COUNTA($F$6:$F$10)=5,MIN($F$24:$F$123),\"\")","v":9856.3816270876287},null,null,"Peak Gain(£)",{"$f":"IF(COUNTA($F$6:$F$10)=5,MAX($F$24:$F$123),\"\")","v":13633.492385720654}]
[null,null,null,{"$f":"(100-F8)/100","v":0.45},null,{"$f":"1-D16","v":0.55000000000000004}]
[]
[null,null,100,{"$f":"IF(COUNTBLANK($F$6:$F$10),\"\",LN(C18)/-LN(D16))","v":5.7672207892310094},null,{"$f":"IF(COUNTBLANK($F$6:$F$10),\"\",LN(C18)/-LN(F16))","v":7.7030531401828721},null,null,null,"Ending Capital (£)",null,{"$f":"IF(COUNTBLANK($F$6:$F$10),\"\",(F523+K523))","v":24821.792082001903},null,null,null,null,null,null,null,null,null,null,null,null,null,"Nett Profit / Loss (%)",null,{"$f":"IF(COUNTBLANK($F$6:$F$10),\"\",(L18-F6)/F6)","v":1.4821792082001903},null,null,null,null,"Ending Capital (£)",{"$f":"IF(COUNTBLANK($F$6:$F$10),\"\",(F124))","v":13387.306796712835},null,null,"Nett Profit / Loss (%)",{"$f":"IF(COUNTBLANK($F$6:$F$10),\"\",(AH18-F6)/F6)","v":0.33873067967128356}]
[]
[null,null,500,{"$f":"IF(COUNTBLANK($F$6:$F$10),\"\",LN(C20)/-LN(D16))","v":7.7827779592587962},null,{"$f":"IF(COUNTBLANK($F$6:$F$10),\"\",LN(C20)/-LN(F16))","v":10.395154683579973},null,null,null,"Nett Profit / Loss (£)",null,{"$f":"IF(COUNTBLANK($F$6:$F$10),\"\",(L18-F6))","v":14821.792082001903},null,null,null,null,null,null,null,null,null,null,null,null,null,"Drawdown Recovery (%)",null,{"$f":"IF(AND(COUNTBLANK($F$6:$F$10)>0,L18=\"\"),\"\",IF(OR(L18<0,L18>=F6),\"NO % DATA IS REQUIRED\",IF(AND(L18>0,L18<F6),(1/(L18/F6)-1),)))","v":"NO % DATA IS REQUIRED"},null,null,null,null,"Nett Profit / Loss (£)",{"$f":"IF(COUNTBLANK($F$6:$F$10),\"\",(AH18-F6))","v":3387.3067967128354},null,null,"Drawdown Recovery (%)",{"$f":"IF(AND(COUNTBLANK($F$6:$F$10)>0,AH18=\"\"),\"\",IF(OR(AH18<0,AH18>=F6),\"NO % DATA IS REQUIRED\",IF(AND(AH18>0,AH18<F6),(1/(AH18/F6)-1),)))","v":"NO % DATA IS REQUIRED"}]
[]
[]
[null," Row & Trade",null,"Random.ORG",null,"Capital (£)",null,{"$f":"IF(COUNTA($F$6:$F$10)=5, CONCATENATE(\"Risk \", F7*100,\"%\"),\"Risk %\")","v":"Risk 1%"},null,null,"Win/Loss (£)","Outcome (L)","Capital +/-%","Count","Position","Repeats","WIN","LOSS","Win Label Pos.","WIN %","LOSS Label Pos","LOSS %","Winning Streaks £'s","Losing Streaks £'s"]
[null,"Row 24 (1)",null,32,null,{"$f":"IF(COUNTBLANK($F$6:$F$10),\"\",$F$6)","v":10000},null,{"$f":"IF(COUNTBLANK($F$6:$F$10),\"\",F24*$F$7)","v":100},null,null,{"$f":"IF(COUNTBLANK($F$6:$F$10),\"\", IF(L24=\"win\", H24*$F$9-$F$10, IF(L24=\"loss\", -H24-$F$10)))","v":120},{"$f":"IF(D24=\"\",\"\",IF(D24<$F$8,\"WIN\",\"LOSS\"))","v":"WIN"},{"$f":"IF(COUNTA($F$6:$F$10)=5,(F25-F24)/F24,\"\")","v":1.2E-2},1,{"$f":"IF(N24=1,IF(N25=1,\"last\",\"new\"),IF(N25=1,\"last\",\"middle\"))","v":"last"},25,{"$f":"COUNTIFS(Outcome,$Q$23,position,\"last\",count,P24)","v":0},{"$f":"SUMPRODUCT((Outcome=$R$23)*(position=\"last\")*(count=P24))","v":0},0.5,{"$f":"IF(Q24=0,\"\",Q24*$P24/500)","v":""},{"$f":"S24+1","v":1.5},{"$f":"IF(R24=0,\"\",R24*$P24/500)","v":""},{"$f":"IF(AND(L24=\"WIN\",L25<>\"WIN\"),SUMIF(L24:L$24,\"WIN\",K24:K$24)-SUM(W$23:W23),\"\")","v":120},{"$f":"IF(AND(L24=\"LOSS\",L25<>\"LOSS\"),SUMIF(L$24:L24,\"LOSS\",K$24:K24)-SUM(X$23:X23),\"\")","v":""}]
[null,"Row 25 (2)",null,96,null,{"$f":"IF(COUNTBLANK($F$6:$F$10),\"\",IF(D24<$F$8,(1+$F$7*$F$9)*F24-$F$10,(1-$F$7)*F24-$F$10))","v":10120},null,{"$f":"IF(COUNTBLANK($F$6:$F$10),\"\",F25*$F$7)","v":101.2},null,null,{"$f":"IF(COUNTBLANK($F$6:$F$10),\"\", IF(L25=\"win\", H25*$F$9-$F$10, IF(L25=\"loss\", -H25-$F$10)))","v":-101.2},{"$f":"IF(D25=\"\",\"\",IF(D25<$F$8,\"WIN\",\"LOSS\"))","v":"LOSS"},{"$f":"IF(COUNTA($F$6:$F$10)=5,(F26-F24)/F24,\"\")","v":1.8799999999999273E-3},{"$f":"IF(L25=L24,N24+1,1)","v":1},{"$f":"IF(N25=1,IF(N26=1,\"last\",\"new\"),IF(N26=1,\"last\",\"middle\"))","v":"new"},24,{"$f":"COUNTIFS(Outcome,$Q$23,position,\"last\",count,P25)","v":0},0,2.5,"",3.5,"",{"$f":"IF(AND(L25=\"WIN\",L26<>\"WIN\"),SUMIF(L$24:L25,\"WIN\",K$24:K25)-SUM(W$23:W24),\"\")","v":""},{"$f":"IF(AND(L25=\"LOSS\",L26<>\"LOSS\"),SUMIF(L$24:L25,\"LOSS\",K$24:K25)-SUM(X$23:X24),\"\")","v":""}]
[null,"Row 26 (3)",null,81,null,{"$f":"IF(COUNTBLANK($F$6:$F$10),\"\",IF(D25<$F$8,(1+$F$7*$F$9)*F25-$F$10,(1-$F$7)*F25-$F$10))","v":10018.799999999999},null,100.18799999999999,null,null,{"$f":"IF(COUNTBLANK($F$6:$F$10),\"\", IF(L26=\"win\", H26*$F$9-$F$10, IF(L26=\"loss\", -H26-$F$10)))","v":-100.18799999999999},"LOSS",{"$f":"IF(COUNTA($F$6:$F$10)=5,(F27-F24)/F24,\"\")","v":-8.1388000000000831E-3},2,"last",23,0,0,4.5,"",5.5,"",{"$f":"IF(AND(L26=\"WIN\",L27<>\"WIN\"),SUMIF(L$24:L26,\"WIN\",K$24:K26)-SUM(W$23:W25),\"\")","v":""},{"$f":"IF(AND(L26=\"LOSS\",L27<>\"LOSS\"),SUMIF(L$24:L26,\"LOSS\",K$24:K26)-SUM(X$23:X25),\"\")","v":-201.38799999999998}]
[null,"Row 27 (4)",null,32,null,9918.6119999999992,null,99.186119999999988,null,null,119.02334399999998,"WIN",{"$f":"IF(COUNTA($F$6:$F$10)=5,(F28-F24)/F24,\"\")","v":3.7635343999998438E-3},1,"new",22,0,0,6.5,"",7.5,"",{"$f":"IF(AND(L27=\"WIN\",L28<>\"WIN\"),SUMIF(L$24:L27,\"WIN\",K$24:K27)-SUM(W$23:W26),\"\")","v":""},{"$f":"IF(AND(L27=\"LOSS\",L28<>\"LOSS\"),SUMIF(L$24:L27,\"LOSS\",K$24:K27)-SUM(X$23:X26),\"\")","v":""}]
[null,"Row 28 (5)",null,5,null,10037.635343999998,null,100.37635343999999,null,null,120.45162412799998,"WIN",{"$f":"IF(COUNTA($F$6:$F$10)=5,(F29-F24)/F24,\"\")","v":1.5808696812799825E-2},2,"last",21,0,0,8.5,"",9.5,"",{"$f":"IF(AND(L28=\"WIN\",L29<>\"WIN\"),SUMIF(L$24:L28,\"WIN\",K$24:K28)-SUM(W$23:W27),\"\")","v":239.47496812799994},{"$f":"IF(AND(L28=\"LOSS\",L29<>\"LOSS\"),SUMIF(L$24:L28,\"LOSS\",K$24:K28)-SUM(X$23:X27),\"\")","v":""}]
[null,"Row 29 (6)",null,90,null,10158.086968127998,null,101.58086968127998,null,null,-101.58086968127998,"LOSS",{"$f":"IF(COUNTA($F$6:$F$10)=5,(F30-F24)/F24,\"\")","v":5.6506098446718169E-3},1,"new",20,0,0,10.5,"",11.5,"",{"$f":"IF(AND(L29=\"WIN\",L30<>\"WIN\"),SUMIF(L$24:L29,\"WIN\",K$24:K29)-SUM(W$23:W28),\"\")","v":""},{"$f":"IF(AND(L29=\"LOSS\",L30<>\"LOSS\"),SUMIF(L$24:L29,\"LOSS\",K$24:K29)-SUM(X$23:X28),\"\")","v":""}]
[null,"Row 30 (7)",null,70,null,10056.506098446718,null,100.56506098446718,null,null,-100.56506098446718,"LOSS",{"$f":"IF(COUNTA($F$6:$F$10)=5,(F31-F24)/F24,\"\")","v":-4.4058962537748816E-3},2,"middle",19,0,0,12.5,"",13.5,"",{"$f":"IF(AND(L30=\"WIN\",L31<>\"WIN\"),SUMIF(L$24:L30,\"WIN\",K$24:K30)-SUM(W$23:W29),\"\")","v":""},{"$f":"IF(AND(L30=\"LOSS\",L31<>\"LOSS\"),SUMIF(L$24:L30,\"LOSS\",K$24:K30)-SUM(X$23:X29),\"\")","v":""}]
[null,"Row 31 (8)",null,100,null,9955.9410374622512,null,99.559410374622516,null,null,-99.559410374622516,"LOSS",{"$f":"IF(COUNTA($F$6:$F$10)=5,(F32-F24)/F24,\"\")","v":-1.4361837291237134E-2},3,"last",18,0,0,14.5,{"$f":"IF(Q31=0,\"\",Q31*$P31/500)","v":""},{"$f":"S31+1","v":15.5},"",{"$f":"IF(AND(L31=\"WIN\",L32<>\"WIN\"),SUMIF(L$24:L31,\"WIN\",K$24:K31)-SUM(W$23:W30),\"\")","v":""},{"$f":"IF(AND(L31=\"LOSS\",L32<>\"LOSS\"),SUMIF(L$24:L31,\"LOSS\",K$24:K31)-SUM(X$23:X30),\"\")","v":-301.70534104036966}]
[null,"Row 32 (9)",null,53,null,9856.3816270876287,null,98.563816270876288,null,null,118.27657952505155,"WIN",{"$f":"IF(COUNTA($F$6:$F$10)=5,(F33-F24)/F24,\"\")","v":-2.5341793387318829E-3},1,"new",17,0,0,16.5,"",{"$f":"S32+1","v":17.5},"",{"$f":"IF(AND(L32=\"WIN\",L33<>\"WIN\"),SUMIF(L$24:L32,\"WIN\",K$24:K32)-SUM(W$23:W31),\"\")","v":""},{"$f":"IF(AND(L32=\"LOSS\",L33<>\"LOSS\"),SUMIF(L$24:L32,\"LOSS\",K$24:K32)-SUM(X$23:X31),\"\")","v":""}]
[null,"Row 33 (10)",null,46,null,9974.6582066126812,null,99.74658206612682,null,null,119.69589847935218,"WIN",{"$f":"IF(COUNTA($F$6:$F$10)=5,(F34-F24)/F24,\"\")","v":9.435410509203393E-3},2,"middle",16,0,0,18.5,"",19.5,"",{"$f":"IF(AND(L33=\"WIN\",L34<>\"WIN\"),SUMIF(L$24:L33,\"WIN\",K$24:K33)-SUM(W$23:W32),\"\")","v":""},{"$f":"IF(AND(L33=\"LOSS\",L34<>\"LOSS\"),SUMIF(L$24:L33,\"LOSS\",K$24:K33)-SUM(X$23:X32),\"\")","v":""}]
[null,"Row 34 (11)",null,37,null,10094.354105092034,null,100.94354105092035,null,null,121.13224926110441,"WIN",{"$f":"IF(COUNTA($F$6:$F$10)=5,(F35-F24)/F24,\"\")","v":2.1548635435313917E-2},3,"last",15,0,0,20.5,"",21.5,"",{"$f":"IF(AND(L34=\"WIN\",L35<>\"WIN\"),SUMIF(L$24:L34,\"WIN\",K$24:K34)-SUM(W$23:W33),\"\")","v":359.10472726550819},{"$f":"IF(AND(L34=\"LOSS\",L35<>\"LOSS\"),SUMIF(L$24:L34,\"LOSS\",K$24:K34)-SUM(X$23:X33),\"\")","v":""}]
[null,"Row 35 (12)",null,89,null,10215.486354353139,null,102.15486354353139,null,null,-102.15486354353139,"LOSS",{"$f":"IF(COUNTA($F$6:$F$10)=5,(F36-F24)/F24,\"\")","v":1.133314908096072E-2},1,"last",14,0,0,22.5,"",23.5,"",{"$f":"IF(AND(L35=\"WIN\",L36<>\"WIN\"),SUMIF(L$24:L35,\"WIN\",K$24:K35)-SUM(W$23:W34),\"\")","v":""},{"$f":"IF(AND(L35=\"LOSS\",L36<>\"LOSS\"),SUMIF(L$24:L35,\"LOSS\",K$24:K35)-SUM(X$23:X34),\"\")","v":-102.15486354353141}]
[null,"Row 36 (13)",null,28,null,10113.331490809607,null,101.13331490809607,null,null,121.35997788971528,"WIN",{"$f":"IF(COUNTA($F$6:$F$10)=5,(F37-F24)/F24,\"\")","v":2.346914686993223E-2},1,"new",13,0,0,24.5,"",25.5,"",{"$f":"IF(AND(L36=\"WIN\",L37<>\"WIN\"),SUMIF(L$24:L36,\"WIN\",K$24:K36)-SUM(W$23:W35),\"\")","v":""},{"$f":"IF(AND(L36=\"LOSS\",L37<>\"LOSS\"),SUMIF(L$24:L36,\"LOSS\",K$24:K36)-SUM(X$23:X35),\"\")","v":""}]
[null,"Row 37 (14)",null,22,null,10234.691468699322,null,102.34691468699323,null,null,122.81629762439186,"WIN",{"$f":"IF(COUNTA($F$6:$F$10)=5,(F38-F24)/F24,\"\")","v":3.5750776632371341E-2},2,"middle",12,0,0,26.5,"",27.5,"",{"$f":"IF(AND(L37=\"WIN\",L38<>\"WIN\"),SUMIF(L$24:L37,\"WIN\",K$24:K37)-SUM(W$23:W36),\"\")","v":""},{"$f":"IF(AND(L37=\"LOSS\",L38<>\"LOSS\"),SUMIF(L$24:L37,\"LOSS\",K$24:K37)-SUM(X$23:X36),\"\")","v":""}]
[null,"Row 38 (15)",null,22,null,10357.507766323713,null,103.57507766323714,null,null,124.29009319588457,"WIN",{"$f":"IF(COUNTA($F$6:$F$10)=5,(F39-F24)/F24,\"\")","v":4.8179785951959819E-2},3,"middle",11,0,0,28.5,"",29.5,"",{"$f":"IF(AND(L38=\"WIN\",L39<>\"WIN\"),SUMIF(L$24:L38,\"WIN\",K$24:K38)-SUM(W$23:W37),\"\")","v":""},{"$f":"IF(AND(L38=\"LOSS\",L39<>\"LOSS\"),SUMIF(L$24:L38,\"LOSS\",K$24:K38)-SUM(X$23:X37),\"\")","v":""}]
[null,"Row 39 (16)",null,33,null,10481.797859519598,null,104.81797859519598,null,null,125.78157431423517,"WIN",{"$f":"IF(COUNTA($F$6:$F$10)=5,(F40-F24)/F24,\"\")","v":6.0757943383383278E-2},4,"last",10,0,0,30.5,"",31.5,"",{"$f":"IF(AND(L39=\"WIN\",L40<>\"WIN\"),SUMIF(L$24:L39,\"WIN\",K$24:K39)-SUM(W$23:W38),\"\")","v":494.24794302422708},{"$f":"IF(AND(L39=\"LOSS\",L40<>\"LOSS\"),SUMIF(L$24:L39,\"LOSS\",K$24:K39)-SUM(X$23:X38),\"\")","v":""}]
[null,"Row 40 (17)",null,81,null,10607.579433833833,null,106.07579433833833,null,null,-106.07579433833833,"LOSS",{"$f":"IF(COUNTA($F$6:$F$10)=5,(F41-F24)/F24,\"\")","v":5.0150363949549498E-2},1,"last",9,1,0,32.5,1.7999999999999999E-2,33.5,"",{"$f":"IF(AND(L40=\"WIN\",L41<>\"WIN\"),SUMIF(L$24:L40,\"WIN\",K$24:K40)-SUM(W$23:W39),\"\")","v":""},{"$f":"IF(AND(L40=\"LOSS\",L41<>\"LOSS\"),SUMIF(L$24:L40,\"LOSS\",K$24:K40)-SUM(X$23:X39),\"\")","v":-106.07579433833837}]
[null,"Row 41 (18)",null,47,null,10501.503639495495,null,105.01503639495495,null,null,126.01804367394593,"WIN",{"$f":"IF(COUNTA($F$6:$F$10)=5,(F42-F24)/F24,\"\")","v":6.2752168316944149E-2},1,"new",8,1,0,34.5,1.6E-2,{"$f":"S41+1","v":35.5},"",{"$f":"IF(AND(L41=\"WIN\",L42<>\"WIN\"),SUMIF(L$24:L41,\"WIN\",K$24:K41)-SUM(W$23:W40),\"\")","v":""},{"$f":"IF(AND(L41=\"LOSS\",L42<>\"LOSS\"),SUMIF(L$24:L41,\"LOSS\",K$24:K41)-SUM(X$23:X40),\"\")","v":""}]
[null,"Row 42 (19)",null,38,null,10627.521683169442,null,106.27521683169442,null,null,127.5302601980333,"WIN",{"$f":"IF(COUNTA($F$6:$F$10)=5,(F43-F24)/F24,\"\")","v":7.5505194336747447E-2},2,"middle",7,3,1,36.5,4.2000000000000003E-2,{"$f":"S42+1","v":37.5},1.4E-2,{"$f":"IF(AND(L42=\"WIN\",L43<>\"WIN\"),SUMIF(L$24:L42,\"WIN\",K$24:K42)-SUM(W$23:W41),\"\")","v":""},{"$f":"IF(AND(L42=\"LOSS\",L43<>\"LOSS\"),SUMIF(L$24:L42,\"LOSS\",K$24:K42)-SUM(X$23:X41),\"\")","v":""}]
[null,"Row 43 (20)",null,30,null,10755.051943367474,null,107.55051943367475,null,null,129.06062332040969,"WIN",{"$f":"IF(COUNTA($F$6:$F$10)=5,(F44-F24)/F24,\"\")","v":8.8411256668788338E-2},3,"middle",6,1,0,38.5,1.2E-2,39.5,"",{"$f":"IF(AND(L43=\"WIN\",L44<>\"WIN\"),SUMIF(L$24:L43,\"WIN\",K$24:K43)-SUM(W$23:W42),\"\")","v":""},{"$f":"IF(AND(L43=\"LOSS\",L44<>\"LOSS\"),SUMIF(L$24:L43,\"LOSS\",K$24:K43)-SUM(X$23:X42),\"\")","v":""}]
[null,"Row 44 (21)",null,29,null,10884.112566687883,null,108.84112566687884,null,null,130.60935080025459,"WIN",{"$f":"IF(COUNTA($F$6:$F$10)=5,(F45-F24)/F24,\"\")","v":0.10147219174881375},4,"middle",5,3,4,40.5,0.03,{"$f":"S44+1","v":41.5},0.04,{"$f":"IF(AND(L44=\"WIN\",L45<>\"WIN\"),SUMIF(L$24:L44,\"WIN\",K$24:K44)-SUM(W$23:W43),\"\")","v":""},{"$f":"IF(AND(L44=\"LOSS\",L45<>\"LOSS\"),SUMIF(L$24:L44,\"LOSS\",K$24:K44)-SUM(X$23:X43),\"\")","v":""}]
[null,"Row 45 (22)",null,21,null,11014.721917488137,null,110.14721917488137,null,null,132.17666300985763,"WIN",{"$f":"IF(COUNTA($F$6:$F$10)=5,(F46-F24)/F24,\"\")","v":0.11468985804979948},5,"last",4,9,10,42.5,7.1999999999999995E-2,{"$f":"S45+1","v":43.5},0.08,{"$f":"IF(AND(L45=\"WIN\",L46<>\"WIN\"),SUMIF(L$24:L45,\"WIN\",K$24:K45)-SUM(W$23:W44),\"\")","v":645.39494100250113},{"$f":"IF(AND(L45=\"LOSS\",L46<>\"LOSS\"),SUMIF(L$24:L45,\"LOSS\",K$24:K45)-SUM(X$23:X44),\"\")","v":""}]
[null,"Row 46 (23)",null,61,null,11146.898580497995,null,111.46898580497995,null,null,-111.46898580497995,"LOSS",{"$f":"IF(COUNTA($F$6:$F$10)=5,(F47-F24)/F24,\"\")","v":0.10354295946930142},1,"last",3,20,15,44.5,0.12,45.5,0.09,{"$f":"IF(AND(L46=\"WIN\",L47<>\"WIN\"),SUMIF(L$24:L46,\"WIN\",K$24:K46)-SUM(W$23:W45),\"\")","v":""},{"$f":"IF(AND(L46=\"LOSS\",L47<>\"LOSS\"),SUMIF(L$24:L46,\"LOSS\",K$24:K46)-SUM(X$23:X45),\"\")","v":-111.46898580497998}]
[null,"Row 47 (24)",null,48,null,11035.429594693014,null,110.35429594693015,null,null,132.42515513631616,"WIN",{"$f":"IF(COUNTA($F$6:$F$10)=5,(F48-F24)/F24,\"\")","v":0.11678547498293301},1,"new",2,27,25,46.5,0.108,47.5,0.1,{"$f":"IF(AND(L47=\"WIN\",L48<>\"WIN\"),SUMIF(L$24:L47,\"WIN\",K$24:K47)-SUM(W$23:W46),\"\")","v":""},{"$f":"IF(AND(L47=\"LOSS\",L48<>\"LOSS\"),SUMIF(L$24:L47,\"LOSS\",K$24:K47)-SUM(X$23:X46),\"\")","v":""}]
[null,"Row 48 (25)",null,42,null,11167.85474982933,null,111.6785474982933,null,null,134.01425699795195,"WIN",{"$f":"IF(COUNTA($F$6:$F$10)=5,(F49-F24)/F24,\"\")","v":0.13018690068272826},2,"middle",1,58,68,48.5,{"$f":"IF(Q48=0,\"\",Q48*$P48/500)","v":0.11600000000000001},49.5,{"$f":"IF(R48=0,\"\",R48*$P48/500)","v":0.13600000000000001},{"$f":"IF(AND(L48=\"WIN\",L49<>\"WIN\"),SUMIF(L$24:L48,\"WIN\",K$24:K48)-SUM(W$23:W47),\"\")","v":""},{"$f":"IF(AND(L48=\"LOSS\",L49<>\"LOSS\"),SUMIF(L$24:L48,\"LOSS\",K$24:K48)-SUM(X$23:X47),\"\")","v":""}]
[null,"Row 49 (26)",null,7,null,11301.869006827283,null,113.01869006827283,null,null,135.62242808192738,"WIN",{"$f":"IF(COUNTA($F$6:$F$10)=5,(F50-F24)/F24,\"\")","v":0.14374914349092105},3,"middle",null,null,null,null,null,null,null,{"$f":"IF(AND(L49=\"WIN\",L50<>\"WIN\"),SUMIF(L$24:L49,\"WIN\",K$24:K49)-SUM(W$23:W48),\"\")","v":""},{"$f":"IF(AND(L49=\"LOSS\",L50<>\"LOSS\"),SUMIF(L$24:L49,\"LOSS\",K$24:K49)-SUM(X$23:X48),\"\")","v":""}]
[null,"Row 50 (27)",null,37,null,11437.491434909211,null,114.37491434909211,null,null,137.24989721891052,"WIN",{"$f":"IF(COUNTA($F$6:$F$10)=5,(F51-F24)/F24,\"\")","v":0.1574741332128122},4,"middle",null,null,null,null,null,null,null,{"$f":"IF(AND(L50=\"WIN\",L51<>\"WIN\"),SUMIF(L$24:L50,\"WIN\",K$24:K50)-SUM(W$23:W49),\"\")","v":""},{"$f":"IF(AND(L50=\"LOSS\",L51<>\"LOSS\"),SUMIF(L$24:L50,\"LOSS\",K$24:K50)-SUM(X$23:X49),\"\")","v":""}]
[null,"Row 51 (28)",null,33,null,11574.741332128122,null,115.74741332128121,null,null,138.89689598553744,"WIN",{"$f":"IF(COUNTA($F$6:$F$10)=5,(F52-F24)/F24,\"\")","v":0.17136382281136595},5,"middle",null,null,null,null,null,null,null,{"$f":"IF(AND(L51=\"WIN\",L52<>\"WIN\"),SUMIF(L$24:L51,\"WIN\",K$24:K51)-SUM(W$23:W50),\"\")","v":""},{"$f":"IF(AND(L51=\"LOSS\",L52<>\"LOSS\"),SUMIF(L$24:L51,\"LOSS\",K$24:K51)-SUM(X$23:X50),\"\")","v":""}]
[null,"Row 52 (29)",null,40,null,11713.638228113659,null,117.13638228113659,null,null,140.56365873736391,"WIN",{"$f":"IF(COUNTA($F$6:$F$10)=5,(F53-F24)/F24,\"\")","v":0.18542018868510241},6,"middle",null,null,null,null,null,null,null,{"$f":"IF(AND(L52=\"WIN\",L53<>\"WIN\"),SUMIF(L$24:L52,\"WIN\",K$24:K52)-SUM(W$23:W51),\"\")","v":""},{"$f":"IF(AND(L52=\"LOSS\",L53<>\"LOSS\"),SUMIF(L$24:L52,\"LOSS\",K$24:K52)-SUM(X$23:X51),\"\")","v":""}]
[null,"Row 53 (30)",null,17,null,11854.201886851024,null,118.54201886851024,null,null,142.25042264221227,"WIN",{"$f":"IF(COUNTA($F$6:$F$10)=5,(F54-F24)/F24,\"\")","v":0.19964523094932357},7,"last",null,null,null,null,null,null,null,{"$f":"IF(AND(L53=\"WIN\",L54<>\"WIN\"),SUMIF(L$24:L53,\"WIN\",K$24:K53)-SUM(W$23:W52),\"\")","v":961.02271480021955},{"$f":"IF(AND(L53=\"LOSS\",L54<>\"LOSS\"),SUMIF(L$24:L53,\"LOSS\",K$24:K53)-SUM(X$23:X52),\"\")","v":""}]
[null,"Row 54 (31)",null,72,null,11996.452309493236,null,119.96452309493236,null,null,-119.96452309493236,"LOSS",{"$f":"IF(COUNTA($F$6:$F$10)=5,(F55-F24)/F24,\"\")","v":0.18764877863983037},1,"last",null,null,null,null,null,null,null,{"$f":"IF(AND(L54=\"WIN\",L55<>\"WIN\"),SUMIF(L$24:L54,\"WIN\",K$24:K54)-SUM(W$23:W53),\"\")","v":""},{"$f":"IF(AND(L54=\"LOSS\",L55<>\"LOSS\"),SUMIF(L$24:L54,\"LOSS\",K$24:K54)-SUM(X$23:X53),\"\")","v":-119.96452309493236}]
[null,"Row 55 (32)",null,25,null,11876.487786398304,null,118.76487786398305,null,null,142.51785343677966,"WIN",{"$f":"IF(COUNTA($F$6:$F$10)=5,(F56-F24)/F24,\"\")","v":0.20190056398350845},1,"new",null,null,null,null,null,null,null,{"$f":"IF(AND(L55=\"WIN\",L56<>\"WIN\"),SUMIF(L$24:L55,\"WIN\",K$24:K55)-SUM(W$23:W54),\"\")","v":""},{"$f":"IF(AND(L55=\"LOSS\",L56<>\"LOSS\"),SUMIF(L$24:L55,\"LOSS\",K$24:K55)-SUM(X$23:X54),\"\")","v":""}]
[null,"Row 56 (33)",null,11,null,12019.005639835084,null,120.19005639835085,null,null,144.22806767802101,"WIN",{"$f":"IF(COUNTA($F$6:$F$10)=5,(F57-F24)/F24,\"\")","v":0.21632337075131053},2,"last",null,null,null,null,null,null,null,{"$f":"IF(AND(L56=\"WIN\",L57<>\"WIN\"),SUMIF(L$24:L56,\"WIN\",K$24:K56)-SUM(W$23:W55),\"\")","v":286.74592111480069},{"$f":"IF(AND(L56=\"LOSS\",L57<>\"LOSS\"),SUMIF(L$24:L56,\"LOSS\",K$24:K56)-SUM(X$23:X55),\"\")","v":""}]
[null,"Row 57 (34)",null,58,null,12163.233707513105,null,121.63233707513106,null,null,-121.63233707513106,"LOSS",{"$f":"IF(COUNTA($F$6:$F$10)=5,(F58-F24)/F24,\"\")","v":0.20416013704379748},1,"new",null,null,null,null,null,null,null,{"$f":"IF(AND(L57=\"WIN\",L58<>\"WIN\"),SUMIF(L$24:L57,\"WIN\",K$24:K57)-SUM(W$23:W56),\"\")","v":""},{"$f":"IF(AND(L57=\"LOSS\",L58<>\"LOSS\"),SUMIF(L$24:L57,\"LOSS\",K$24:K57)-SUM(X$23:X56),\"\")","v":""}]
[null,"Row 58 (35)",null,91,null,12041.601370437975,null,120.41601370437975,null,null,-120.41601370437975,"LOSS",{"$f":"IF(COUNTA($F$6:$F$10)=5,(F59-F24)/F24,\"\")","v":0.19211853567335949},2,"last",null,null,null,null,null,null,null,{"$f":"IF(AND(L58=\"WIN\",L59<>\"WIN\"),SUMIF(L$24:L58,\"WIN\",K$24:K58)-SUM(W$23:W57),\"\")","v":""},{"$f":"IF(AND(L58=\"LOSS\",L59<>\"LOSS\"),SUMIF(L$24:L58,\"LOSS\",K$24:K58)-SUM(X$23:X57),\"\")","v":-242.04835077951077}]
[null,"Row 59 (36)",null,7,null,11921.185356733595,null,119.21185356733595,null,null,143.05422428080314,"WIN",{"$f":"IF(COUNTA($F$6:$F$10)=5,(F60-F24)/F24,\"\")","v":0.20642395810143971},1,"last",null,null,null,null,null,null,null,{"$f":"IF(AND(L59=\"WIN\",L60<>\"WIN\"),SUMIF(L$24:L59,\"WIN\",K$24:K59)-SUM(W$23:W58),\"\")","v":143.05422428080328},{"$f":"IF(AND(L59=\"LOSS\",L60<>\"LOSS\"),SUMIF(L$24:L59,\"LOSS\",K$24:K59)-SUM(X$23:X58),\"\")","v":""}]
[null,"Row 60 (37)",null,95,null,12064.239581014397,null,120.64239581014397,null,null,-120.64239581014397,"LOSS",{"$f":"IF(COUNTA($F$6:$F$10)=5,(F61-F24)/F24,\"\")","v":0.1943597185204253},1,"last",null,null,null,null,null,null,null,{"$f":"IF(AND(L60=\"WIN\",L61<>\"WIN\"),SUMIF(L$24:L60,\"WIN\",K$24:K60)-SUM(W$23:W59),\"\")","v":""},{"$f":"IF(AND(L60=\"LOSS\",L61<>\"LOSS\"),SUMIF(L$24:L60,\"LOSS\",K$24:K60)-SUM(X$23:X59),\"\")","v":-120.64239581014385}]
[null,"Row 61 (38)",null,5,null,11943.597185204253,null,119.43597185204253,null,null,143.32316622245102,"WIN",{"$f":"IF(COUNTA($F$6:$F$10)=5,(F62-F24)/F24,\"\")","v":0.20869203514267046},1,"last",null,null,null,null,null,null,null,{"$f":"IF(AND(L61=\"WIN\",L62<>\"WIN\"),SUMIF(L$24:L61,\"WIN\",K$24:K61)-SUM(W$23:W60),\"\")","v":143.32316622245116},{"$f":"IF(AND(L61=\"LOSS\",L62<>\"LOSS\"),SUMIF(L$24:L61,\"LOSS\",K$24:K61)-SUM(X$23:X60),\"\")","v":""}]
[null,"Row 62 (39)",null,73,null,12086.920351426705,null,120.86920351426704,null,null,-120.86920351426704,"LOSS",{"$f":"IF(COUNTA($F$6:$F$10)=5,(F63-F24)/F24,\"\")","v":0.19660511479124379},1,"last",null,null,null,null,null,null,null,{"$f":"IF(AND(L62=\"WIN\",L63<>\"WIN\"),SUMIF(L$24:L62,\"WIN\",K$24:K62)-SUM(W$23:W61),\"\")","v":""},{"$f":"IF(AND(L62=\"LOSS\",L63<>\"LOSS\"),SUMIF(L$24:L62,\"LOSS\",K$24:K62)-SUM(X$23:X61),\"\")","v":-120.86920351426716}]
[null,"Row 63 (40)",null,1,null,11966.051147912438,null,119.66051147912438,null,null,143.59261377494926,"WIN",{"$f":"IF(COUNTA($F$6:$F$10)=5,(F64-F24)/F24,\"\")","v":0.21096437616873881},1,"new",null,null,null,null,null,null,null,{"$f":"IF(AND(L63=\"WIN\",L64<>\"WIN\"),SUMIF(L$24:L63,\"WIN\",K$24:K63)-SUM(W$23:W62),\"\")","v":""},{"$f":"IF(AND(L63=\"LOSS\",L64<>\"LOSS\"),SUMIF(L$24:L63,\"LOSS\",K$24:K63)-SUM(X$23:X62),\"\")","v":""}]
[null,"Row 64 (41)",null,50,null,12109.643761687388,null,121.09643761687389,null,null,145.31572514024865,"WIN",{"$f":"IF(COUNTA($F$6:$F$10)=5,(F65-F24)/F24,\"\")","v":0.22549594868276363},2,"last",null,null,null,null,null,null,null,{"$f":"IF(AND(L64=\"WIN\",L65<>\"WIN\"),SUMIF(L$24:L64,\"WIN\",K$24:K64)-SUM(W$23:W63),\"\")","v":288.90833891519787},{"$f":"IF(AND(L64=\"LOSS\",L65<>\"LOSS\"),SUMIF(L$24:L64,\"LOSS\",K$24:K64)-SUM(X$23:X63),\"\")","v":""}]
[null,"Row 65 (42)",null,87,null,12254.959486827636,null,122.54959486827636,null,null,-122.54959486827636,"LOSS",{"$f":"IF(COUNTA($F$6:$F$10)=5,(F66-F24)/F24,\"\")","v":0.21324098919593598},1,"last",null,null,null,null,null,null,null,{"$f":"IF(AND(L65=\"WIN\",L66<>\"WIN\"),SUMIF(L$24:L65,\"WIN\",K$24:K65)-SUM(W$23:W64),\"\")","v":""},{"$f":"IF(AND(L65=\"LOSS\",L66<>\"LOSS\"),SUMIF(L$24:L65,\"LOSS\",K$24:K65)-SUM(X$23:X64),\"\")","v":-122.54959486827647}]
[null,"Row 66 (43)",null,37,null,12132.40989195936,null,121.3240989195936,null,null,145.58891870351232,"WIN",{"$f":"IF(COUNTA($F$6:$F$10)=5,(F67-F24)/F24,\"\")","v":0.22779988106628715},1,"last",null,null,null,null,null,null,null,{"$f":"IF(AND(L66=\"WIN\",L67<>\"WIN\"),SUMIF(L$24:L66,\"WIN\",K$24:K66)-SUM(W$23:W65),\"\")","v":145.58891870351226},{"$f":"IF(AND(L66=\"LOSS\",L67<>\"LOSS\"),SUMIF(L$24:L66,\"LOSS\",K$24:K66)-SUM(X$23:X65),\"\")","v":""}]
[null,"Row 67 (44)",null,70,null,12277.998810662872,null,122.77998810662872,null,null,-122.77998810662872,"LOSS",{"$f":"IF(COUNTA($F$6:$F$10)=5,(F68-F24)/F24,\"\")","v":0.21552188225562421},1,"last",null,null,null,null,null,null,null,{"$f":"IF(AND(L67=\"WIN\",L68<>\"WIN\"),SUMIF(L$24:L67,\"WIN\",K$24:K67)-SUM(W$23:W66),\"\")","v":""},{"$f":"IF(AND(L67=\"LOSS\",L68<>\"LOSS\"),SUMIF(L$24:L67,\"LOSS\",K$24:K67)-SUM(X$23:X66),\"\")","v":-122.77998810662871}]
[null,"Row 68 (45)",null,34,null,12155.218822556242,null,121.55218822556242,null,null,145.86262587067489,"WIN",{"$f":"IF(COUNTA($F$6:$F$10)=5,(F69-F24)/F24,\"\")","v":0.23010814484269176},1,"new",null,null,null,null,null,null,null,{"$f":"IF(AND(L68=\"WIN\",L69<>\"WIN\"),SUMIF(L$24:L68,\"WIN\",K$24:K68)-SUM(W$23:W67),\"\")","v":""},{"$f":"IF(AND(L68=\"LOSS\",L69<>\"LOSS\"),SUMIF(L$24:L68,\"LOSS\",K$24:K68)-SUM(X$23:X67),\"\")","v":""}]
[null,"Row 69 (46)",null,27,null,12301.081448426918,null,123.01081448426918,null,null,147.61297738112302,"WIN",{"$f":"IF(COUNTA($F$6:$F$10)=5,(F70-F24)/F24,\"\")","v":0.24486944258080404},2,"last",null,null,null,null,null,null,null,{"$f":"IF(AND(L69=\"WIN\",L70<>\"WIN\"),SUMIF(L$24:L69,\"WIN\",K$24:K69)-SUM(W$23:W68),\"\")","v":293.47560325179802},{"$f":"IF(AND(L69=\"LOSS\",L70<>\"LOSS\"),SUMIF(L$24:L69,\"LOSS\",K$24:K69)-SUM(X$23:X68),\"\")","v":""}]
[null,"Row 70 (47)",null,73,null,12448.69442580804,null,124.4869442580804,null,null,-124.4869442580804,"LOSS",{"$f":"IF(COUNTA($F$6:$F$10)=5,(F71-F24)/F24,\"\")","v":0.232420748154996},1,"new",null,null,null,null,null,null,null,{"$f":"IF(AND(L70=\"WIN\",L71<>\"WIN\"),SUMIF(L$24:L70,\"WIN\",K$24:K70)-SUM(W$23:W69),\"\")","v":""},{"$f":"IF(AND(L70=\"LOSS\",L71<>\"LOSS\"),SUMIF(L$24:L70,\"LOSS\",K$24:K70)-SUM(X$23:X69),\"\")","v":""}]
[null,"Row 71 (48)",null,68,null,12324.20748154996,null,123.24207481549961,null,null,-123.24207481549961,"LOSS",{"$f":"IF(COUNTA($F$6:$F$10)=5,(F72-F24)/F24,\"\")","v":0.220096540673446},2,"last",null,null,null,null,null,null,null,{"$f":"IF(AND(L71=\"WIN\",L72<>\"WIN\"),SUMIF(L$24:L71,\"WIN\",K$24:K71)-SUM(W$23:W70),\"\")","v":""},{"$f":"IF(AND(L71=\"LOSS\",L72<>\"LOSS\"),SUMIF(L$24:L71,\"LOSS\",K$24:K71)-SUM(X$23:X70),\"\")","v":-247.72901907358005}]
[null,"Row 72 (49)",null,40,null,12200.96540673446,null,122.0096540673446,null,null,146.41158488081351,"WIN",{"$f":"IF(COUNTA($F$6:$F$10)=5,(F73-F24)/F24,\"\")","v":0.23473769916152742},1,"last",null,null,null,null,null,null,null,{"$f":"IF(AND(L72=\"WIN\",L73<>\"WIN\"),SUMIF(L$24:L72,\"WIN\",K$24:K72)-SUM(W$23:W71),\"\")","v":146.41158488081328},{"$f":"IF(AND(L72=\"LOSS\",L73<>\"LOSS\"),SUMIF(L$24:L72,\"LOSS\",K$24:K72)-SUM(X$23:X71),\"\")","v":""}]
[null,"Row 73 (50)",null,94,null,12347.376991615274,null,123.47376991615275,null,null,-123.47376991615275,"LOSS",{"$f":"IF(COUNTA($F$6:$F$10)=5,(F74-F24)/F24,\"\")","v":0.22239032216991217},1,"last",null,null,null,null,null,null,null,{"$f":"IF(AND(L73=\"WIN\",L74<>\"WIN\"),SUMIF(L$24:L73,\"WIN\",K$24:K73)-SUM(W$23:W72),\"\")","v":""},{"$f":"IF(AND(L73=\"LOSS\",L74<>\"LOSS\"),SUMIF(L$24:L73,\"LOSS\",K$24:K73)-SUM(X$23:X72),\"\")","v":-123.47376991615283}]
[null,"Row 74 (51)",null,25,null,12223.903221699122,null,122.23903221699122,null,null,146.68683866038947,"WIN",{"$f":"IF(COUNTA($F$6:$F$10)=5,(F75-F24)/F24,\"\")","v":0.23705900603595109},1,"last",null,null,null,null,null,null,null,{"$f":"IF(AND(L74=\"WIN\",L75<>\"WIN\"),SUMIF(L$24:L74,\"WIN\",K$24:K74)-SUM(W$23:W73),\"\")","v":146.68683866038918},{"$f":"IF(AND(L74=\"LOSS\",L75<>\"LOSS\"),SUMIF(L$24:L74,\"LOSS\",K$24:K74)-SUM(X$23:X73),\"\")","v":""}]
[null,"Row 75 (52)",null,79,null,12370.590060359511,null,123.70590060359511,null,null,-123.70590060359511,"LOSS",{"$f":"IF(COUNTA($F$6:$F$10)=5,(F76-F24)/F24,\"\")","v":0.2246884159755915},1,"new",null,null,null,null,null,null,null,{"$f":"IF(AND(L75=\"WIN\",L76<>\"WIN\"),SUMIF(L$24:L75,\"WIN\",K$24:K75)-SUM(W$23:W74),\"\")","v":""},{"$f":"IF(AND(L75=\"LOSS\",L76<>\"LOSS\"),SUMIF(L$24:L75,\"LOSS\",K$24:K75)-SUM(X$23:X74),\"\")","v":""}]
[null,"Row 76 (53)",null,98,null,12246.884159755915,null,122.46884159755915,null,null,-122.46884159755915,"LOSS",{"$f":"IF(COUNTA($F$6:$F$10)=5,(F77-F24)/F24,\"\")","v":0.21244153181583553},2,"last",null,null,null,null,null,null,null,{"$f":"IF(AND(L76=\"WIN\",L77<>\"WIN\"),SUMIF(L$24:L76,\"WIN\",K$24:K76)-SUM(W$23:W75),\"\")","v":""},{"$f":"IF(AND(L76=\"LOSS\",L77<>\"LOSS\"),SUMIF(L$24:L76,\"LOSS\",K$24:K76)-SUM(X$23:X75),\"\")","v":-246.17474220115446}]
[null,"Row 77 (54)",null,50,null,12124.415318158355,null,121.24415318158356,null,null,145.49298381790027,"WIN",{"$f":"IF(COUNTA($F$6:$F$10)=5,(F78-F24)/F24,\"\")","v":0.22699083019762548},1,"last",null,null,null,null,null,null,null,{"$f":"IF(AND(L77=\"WIN\",L78<>\"WIN\"),SUMIF(L$24:L77,\"WIN\",K$24:K77)-SUM(W$23:W76),\"\")","v":145.49298381790049},{"$f":"IF(AND(L77=\"LOSS\",L78<>\"LOSS\"),SUMIF(L$24:L77,\"LOSS\",K$24:K77)-SUM(X$23:X76),\"\")","v":""}]
[null,"Row 78 (55)",null,97,null,12269.908301976255,null,122.69908301976255,null,null,-122.69908301976255,"LOSS",{"$f":"IF(COUNTA($F$6:$F$10)=5,(F79-F24)/F24,\"\")","v":0.2147209218956492},1,"new",null,null,null,null,null,null,null,{"$f":"IF(AND(L78=\"WIN\",L79<>\"WIN\"),SUMIF(L$24:L78,\"WIN\",K$24:K78)-SUM(W$23:W77),\"\")","v":""},{"$f":"IF(AND(L78=\"LOSS\",L79<>\"LOSS\"),SUMIF(L$24:L78,\"LOSS\",K$24:K78)-SUM(X$23:X77),\"\")","v":""}]
[null,"Row 79 (56)",null,73,null,12147.209218956492,null,121.47209218956492,null,null,-121.47209218956492,"LOSS",{"$f":"IF(COUNTA($F$6:$F$10)=5,(F80-F24)/F24,\"\")","v":0.20257371267669277},2,"middle",null,null,null,null,null,null,null,{"$f":"IF(AND(L79=\"WIN\",L80<>\"WIN\"),SUMIF(L$24:L79,\"WIN\",K$24:K79)-SUM(W$23:W78),\"\")","v":""},{"$f":"IF(AND(L79=\"LOSS\",L80<>\"LOSS\"),SUMIF(L$24:L79,\"LOSS\",K$24:K79)-SUM(X$23:X78),\"\")","v":""}]
[null,"Row 80 (57)",null,91,null,12025.737126766928,null,120.25737126766928,null,null,-120.25737126766928,"LOSS",{"$f":"IF(COUNTA($F$6:$F$10)=5,(F81-F24)/F24,\"\")","v":0.19054797554992584},3,"last",null,null,null,null,null,null,null,{"$f":"IF(AND(L80=\"WIN\",L81<>\"WIN\"),SUMIF(L$24:L80,\"WIN\",K$24:K80)-SUM(W$23:W79),\"\")","v":""},{"$f":"IF(AND(L80=\"LOSS\",L81<>\"LOSS\"),SUMIF(L$24:L80,\"LOSS\",K$24:K80)-SUM(X$23:X79),\"\")","v":-364.42854647699687}]
[null,"Row 81 (58)",null,48,null,11905.479755499258,null,119.05479755499259,null,null,142.86575706599109,"WIN",{"$f":"IF(COUNTA($F$6:$F$10)=5,(F82-F24)/F24,\"\")","v":0.20483455125652489},1,"last",null,null,null,null,null,null,null,{"$f":"IF(AND(L81=\"WIN\",L82<>\"WIN\"),SUMIF(L$24:L81,\"WIN\",K$24:K81)-SUM(W$23:W80),\"\")","v":142.86575706599069},{"$f":"IF(AND(L81=\"LOSS\",L82<>\"LOSS\"),SUMIF(L$24:L81,\"LOSS\",K$24:K81)-SUM(X$23:X80),\"\")","v":""}]
[null,"Row 82 (59)",null,97,null,12048.345512565249,null,120.4834551256525,null,null,-120.4834551256525,"LOSS",{"$f":"IF(COUNTA($F$6:$F$10)=5,(F83-F24)/F24,\"\")","v":0.19278620574395972},1,"last",null,null,null,null,null,null,null,{"$f":"IF(AND(L82=\"WIN\",L83<>\"WIN\"),SUMIF(L$24:L82,\"WIN\",K$24:K82)-SUM(W$23:W81),\"\")","v":""},{"$f":"IF(AND(L82=\"LOSS\",L83<>\"LOSS\"),SUMIF(L$24:L82,\"LOSS\",K$24:K82)-SUM(X$23:X81),\"\")","v":-120.48345512565265}]
[null,"Row 83 (60)",null,22,null,11927.862057439597,null,119.27862057439597,null,null,143.13434468927517,"WIN",{"$f":"IF(COUNTA($F$6:$F$10)=5,(F84-F24)/F24,\"\")","v":0.20709964021288724},1,"new",null,null,null,null,null,null,null,{"$f":"IF(AND(L83=\"WIN\",L84<>\"WIN\"),SUMIF(L$24:L83,\"WIN\",K$24:K83)-SUM(W$23:W82),\"\")","v":""},{"$f":"IF(AND(L83=\"LOSS\",L84<>\"LOSS\"),SUMIF(L$24:L83,\"LOSS\",K$24:K83)-SUM(X$23:X82),\"\")","v":""}]
[null,"Row 84 (61)",null,9,null,12070.996402128872,null,120.70996402128873,null,null,144.85195682554647,"WIN",{"$f":"IF(COUNTA($F$6:$F$10)=5,(F85-F24)/F24,\"\")","v":0.22158483589544195},2,"middle",null,null,null,null,null,null,null,{"$f":"IF(AND(L84=\"WIN\",L85<>\"WIN\"),SUMIF(L$24:L84,\"WIN\",K$24:K84)-SUM(W$23:W83),\"\")","v":""},{"$f":"IF(AND(L84=\"LOSS\",L85<>\"LOSS\"),SUMIF(L$24:L84,\"LOSS\",K$24:K84)-SUM(X$23:X83),\"\")","v":""}]
[null,"Row 85 (62)",null,51,null,12215.848358954419,null,122.15848358954419,null,null,146.59018030745301,"WIN",{"$f":"IF(COUNTA($F$6:$F$10)=5,(F86-F24)/F24,\"\")","v":0.23624385392618732},3,"middle",null,null,null,null,null,null,null,{"$f":"IF(AND(L85=\"WIN\",L86<>\"WIN\"),SUMIF(L$24:L85,\"WIN\",K$24:K85)-SUM(W$23:W84),\"\")","v":""},{"$f":"IF(AND(L85=\"LOSS\",L86<>\"LOSS\"),SUMIF(L$24:L85,\"LOSS\",K$24:K85)-SUM(X$23:X84),\"\")","v":""}]
[null,"Row 86 (63)",null,47,null,12362.438539261873,null,123.62438539261873,null,null,148.34926247114248,"WIN",{"$f":"IF(COUNTA($F$6:$F$10)=5,(F87-F24)/F24,\"\")","v":0.25107878017330165},4,"middle",null,null,null,null,null,null,null,{"$f":"IF(AND(L86=\"WIN\",L87<>\"WIN\"),SUMIF(L$24:L86,\"WIN\",K$24:K86)-SUM(W$23:W85),\"\")","v":""},{"$f":"IF(AND(L86=\"LOSS\",L87<>\"LOSS\"),SUMIF(L$24:L86,\"LOSS\",K$24:K86)-SUM(X$23:X85),\"\")","v":""}]
[null,"Row 87 (64)",null,12,null,12510.787801733017,null,125.10787801733017,null,null,150.1294536207962,"WIN",{"$f":"IF(COUNTA($F$6:$F$10)=5,(F88-F24)/F24,\"\")","v":0.26609172553538135},5,"last",null,null,null,null,null,null,null,{"$f":"IF(AND(L87=\"WIN\",L88<>\"WIN\"),SUMIF(L$24:L87,\"WIN\",K$24:K87)-SUM(W$23:W86),\"\")","v":733.05519791421284},{"$f":"IF(AND(L87=\"LOSS\",L88<>\"LOSS\"),SUMIF(L$24:L87,\"LOSS\",K$24:K87)-SUM(X$23:X86),\"\")","v":""}]
[null,"Row 88 (65)",null,96,null,12660.917255353814,null,126.60917255353814,null,null,-126.60917255353814,"LOSS",{"$f":"IF(COUNTA($F$6:$F$10)=5,(F89-F24)/F24,\"\")","v":0.25343080828002751},1,"new",null,null,null,null,null,null,null,{"$f":"IF(AND(L88=\"WIN\",L89<>\"WIN\"),SUMIF(L$24:L88,\"WIN\",K$24:K88)-SUM(W$23:W87),\"\")","v":""},{"$f":"IF(AND(L88=\"LOSS\",L89<>\"LOSS\"),SUMIF(L$24:L88,\"LOSS\",K$24:K88)-SUM(X$23:X87),\"\")","v":""}]
[null,"Row 89 (66)",null,98,null,12534.308082800275,null,{"$f":"IF(COUNTBLANK($F$6:$F$10),\"\",F89*$F$7)","v":125.34308082800275},null,null,-125.34308082800275,{"$f":"IF(D89=\"\",\"\",IF(D89<$F$8,\"WIN\",\"LOSS\"))","v":"LOSS"},{"$f":"IF(COUNTA($F$6:$F$10)=5,(F90-F24)/F24,\"\")","v":0.24089650019722722},{"$f":"IF(L89=L88,N88+1,1)","v":2},{"$f":"IF(N89=1,IF(N90=1,\"last\",\"new\"),IF(N90=1,\"last\",\"middle\"))","v":"last"},null,null,null,null,null,null,null,{"$f":"IF(AND(L89=\"WIN\",L90<>\"WIN\"),SUMIF(L$24:L89,\"WIN\",K$24:K89)-SUM(W$23:W88),\"\")","v":""},{"$f":"IF(AND(L89=\"LOSS\",L90<>\"LOSS\"),SUMIF(L$24:L89,\"LOSS\",K$24:K89)-SUM(X$23:X88),\"\")","v":-251.95225338154069}]
[null,"Row 90 (67)",null,13,null,{"$f":"IF(COUNTBLANK($F$6:$F$10),\"\",IF(D89<$F$8,(1+$F$7*$F$9)*F89-$F$10,(1-$F$7)*F89-$F$10))","v":12408.965001972272},null,124.08965001972273,null,null,{"$f":"IF(COUNTBLANK($F$6:$F$10),\"\", IF(L90=\"win\", H90*$F$9-$F$10, IF(L90=\"loss\", -H90-$F$10)))","v":148.90758002366726},"WIN",{"$f":"IF(COUNTA($F$6:$F$10)=5,(F91-F24)/F24,\"\")","v":0.25578725819959403},1,"last",null,null,null,null,null,null,null,{"$f":"IF(AND(L90=\"WIN\",L91<>\"WIN\"),SUMIF(L$24:L90,\"WIN\",K$24:K90)-SUM(W$23:W89),\"\")","v":148.90758002366692},{"$f":"IF(AND(L90=\"LOSS\",L91<>\"LOSS\"),SUMIF(L$24:L90,\"LOSS\",K$24:K90)-SUM(X$23:X89),\"\")","v":""}]
[null,"Row 91 (68)",null,70,null,12557.87258199594,null,125.5787258199594,null,null,-125.5787258199594,"LOSS",{"$f":"IF(COUNTA($F$6:$F$10)=5,(F92-F24)/F24,\"\")","v":0.24322938561759802},1,"last",null,null,null,null,null,null,null,{"$f":"IF(AND(L91=\"WIN\",L92<>\"WIN\"),SUMIF(L$24:L91,\"WIN\",K$24:K91)-SUM(W$23:W90),\"\")","v":""},{"$f":"IF(AND(L91=\"LOSS\",L92<>\"LOSS\"),SUMIF(L$24:L91,\"LOSS\",K$24:K91)-SUM(X$23:X90),\"\")","v":-125.57872581995935}]
[null,"Row 92 (69)",null,12,null,12432.29385617598,null,124.3229385617598,null,null,149.18752627411175,"WIN",{"$f":"IF(COUNTA($F$6:$F$10)=5,(F93-F24)/F24,\"\")","v":0.25814813824500926},1,"new",null,null,null,null,null,null,null,{"$f":"IF(AND(L92=\"WIN\",L93<>\"WIN\"),SUMIF(L$24:L92,\"WIN\",K$24:K92)-SUM(W$23:W91),\"\")","v":""},{"$f":"IF(AND(L92=\"LOSS\",L93<>\"LOSS\"),SUMIF(L$24:L92,\"LOSS\",K$24:K92)-SUM(X$23:X91),\"\")","v":""}]
[null,"Row 93 (70)",null,48,null,12581.481382450092,null,125.81481382450093,null,null,150.97777658940112,"WIN",{"$f":"IF(COUNTA($F$6:$F$10)=5,(F94-F24)/F24,\"\")","v":0.27324591590394937},2,"middle",null,null,null,null,null,null,null,{"$f":"IF(AND(L93=\"WIN\",L94<>\"WIN\"),SUMIF(L$24:L93,\"WIN\",K$24:K93)-SUM(W$23:W92),\"\")","v":""},{"$f":"IF(AND(L93=\"LOSS\",L94<>\"LOSS\"),SUMIF(L$24:L93,\"LOSS\",K$24:K93)-SUM(X$23:X92),\"\")","v":""}]
[null,"Row 94 (71)",null,27,null,12732.459159039494,null,127.32459159039495,null,null,152.78950990847392,"WIN",{"$f":"IF(COUNTA($F$6:$F$10)=5,(F95-F24)/F24,\"\")","v":0.28852486689479684},3,"middle",null,null,null,null,null,null,null,{"$f":"IF(AND(L94=\"WIN\",L95<>\"WIN\"),SUMIF(L$24:L94,\"WIN\",K$24:K94)-SUM(W$23:W93),\"\")","v":""},{"$f":"IF(AND(L94=\"LOSS\",L95<>\"LOSS\"),SUMIF(L$24:L94,\"LOSS\",K$24:K94)-SUM(X$23:X93),\"\")","v":""}]
[null,"Row 95 (72)",null,49,null,12885.248668947968,null,128.85248668947969,null,null,154.62298402737562,"WIN",{"$f":"IF(COUNTA($F$6:$F$10)=5,(F96-F24)/F24,\"\")","v":0.30398716529753439},4,"last",null,null,null,null,null,null,null,{"$f":"IF(AND(L95=\"WIN\",L96<>\"WIN\"),SUMIF(L$24:L95,\"WIN\",K$24:K95)-SUM(W$23:W94),\"\")","v":607.57779679936175},{"$f":"IF(AND(L95=\"LOSS\",L96<>\"LOSS\"),SUMIF(L$24:L95,\"LOSS\",K$24:K95)-SUM(X$23:X94),\"\")","v":""}]
[null,"Row 96 (73)",null,99,null,13039.871652975344,null,130.39871652975344,null,null,-130.39871652975344,"LOSS",{"$f":"IF(COUNTA($F$6:$F$10)=5,(F97-F24)/F24,\"\")","v":0.29094729364455907},1,"new",null,null,null,null,null,null,null,{"$f":"IF(AND(L96=\"WIN\",L97<>\"WIN\"),SUMIF(L$24:L96,\"WIN\",K$24:K96)-SUM(W$23:W95),\"\")","v":""},{"$f":"IF(AND(L96=\"LOSS\",L97<>\"LOSS\"),SUMIF(L$24:L96,\"LOSS\",K$24:K96)-SUM(X$23:X95),\"\")","v":""}]
[null,"Row 97 (74)",null,79,null,12909.472936445591,null,129.0947293644559,null,null,-129.0947293644559,"LOSS",{"$f":"IF(COUNTA($F$6:$F$10)=5,(F98-F24)/F24,\"\")","v":0.27803782070811339},2,"middle",null,null,null,null,null,null,null,{"$f":"IF(AND(L97=\"WIN\",L98<>\"WIN\"),SUMIF(L$24:L97,\"WIN\",K$24:K97)-SUM(W$23:W96),\"\")","v":""},{"$f":"IF(AND(L97=\"LOSS\",L98<>\"LOSS\"),SUMIF(L$24:L97,\"LOSS\",K$24:K97)-SUM(X$23:X96),\"\")","v":""}]
[null,"Row 98 (75)",null,74,null,12780.378207081134,null,127.80378207081134,null,null,-127.80378207081134,"LOSS",{"$f":"IF(COUNTA($F$6:$F$10)=5,(F99-F24)/F24,\"\")","v":0.26525744250103217},3,"middle",null,null,null,null,null,null,null,{"$f":"IF(AND(L98=\"WIN\",L99<>\"WIN\"),SUMIF(L$24:L98,\"WIN\",K$24:K98)-SUM(W$23:W97),\"\")","v":""},{"$f":"IF(AND(L98=\"LOSS\",L99<>\"LOSS\"),SUMIF(L$24:L98,\"LOSS\",K$24:K98)-SUM(X$23:X97),\"\")","v":""}]
[null,"Row 99 (76)",null,65,null,12652.574425010322,null,126.52574425010322,null,null,-126.52574425010322,"LOSS",{"$f":"IF(COUNTA($F$6:$F$10)=5,(F100-F24)/F24,\"\")","v":0.25260486807602195},4,"last",null,null,null,null,null,null,null,{"$f":"IF(AND(L99=\"WIN\",L100<>\"WIN\"),SUMIF(L$24:L99,\"WIN\",K$24:K99)-SUM(W$23:W98),\"\")","v":""},{"$f":"IF(AND(L99=\"LOSS\",L100<>\"LOSS\"),SUMIF(L$24:L99,\"LOSS\",K$24:K99)-SUM(X$23:X98),\"\")","v":-513.82297221512408}]
[null,"Row 100 (77)",null,14,null,12526.048680760219,null,125.26048680760219,null,null,150.31258416912263,"WIN",{"$f":"IF(COUNTA($F$6:$F$10)=5,(F101-F24)/F24,\"\")","v":0.26763612649293428},1,"new",null,null,null,null,null,null,null,{"$f":"IF(AND(L100=\"WIN\",L101<>\"WIN\"),SUMIF(L$24:L100,\"WIN\",K$24:K100)-SUM(W$23:W99),\"\")","v":""},{"$f":"IF(AND(L100=\"LOSS\",L101<>\"LOSS\"),SUMIF(L$24:L100,\"LOSS\",K$24:K100)-SUM(X$23:X99),\"\")","v":""}]
[null,"Row 101 (78)",null,26,null,12676.361264929343,null,126.76361264929344,null,null,152.11633517915212,"WIN",{"$f":"IF(COUNTA($F$6:$F$10)=5,(F102-F24)/F24,\"\")","v":0.28284776001084955},2,"middle",null,null,null,null,null,null,null,{"$f":"IF(AND(L101=\"WIN\",L102<>\"WIN\"),SUMIF(L$24:L101,\"WIN\",K$24:K101)-SUM(W$23:W100),\"\")","v":""},{"$f":"IF(AND(L101=\"LOSS\",L102<>\"LOSS\"),SUMIF(L$24:L101,\"LOSS\",K$24:K101)-SUM(X$23:X100),\"\")","v":""}]
[null,"Row 102 (79)",null,30,null,12828.477600108496,null,128.28477600108496,null,null,153.94173120130196,"WIN",{"$f":"IF(COUNTA($F$6:$F$10)=5,(F103-F24)/F24,\"\")","v":0.29824193313097985},3,"last",null,null,null,null,null,null,null,{"$f":"IF(AND(L102=\"WIN\",L103<>\"WIN\"),SUMIF(L$24:L102,\"WIN\",K$24:K102)-SUM(W$23:W101),\"\")","v":456.37065054957657},{"$f":"IF(AND(L102=\"LOSS\",L103<>\"LOSS\"),SUMIF(L$24:L102,\"LOSS\",K$24:K102)-SUM(X$23:X101),\"\")","v":""}]
[null,"Row 103 (80)",null,57,null,12982.419331309799,null,129.82419331309799,null,null,-129.82419331309799,"LOSS",{"$f":"IF(COUNTA($F$6:$F$10)=5,(F104-F24)/F24,\"\")","v":0.28525951379967007},1,"last",null,null,null,null,null,null,null,{"$f":"IF(AND(L103=\"WIN\",L104<>\"WIN\"),SUMIF(L$24:L103,\"WIN\",K$24:K103)-SUM(W$23:W102),\"\")","v":""},{"$f":"IF(AND(L103=\"LOSS\",L104<>\"LOSS\"),SUMIF(L$24:L103,\"LOSS\",K$24:K103)-SUM(X$23:X102),\"\")","v":-129.82419331309802}]
[null,"Row 104 (81)",null,53,null,12852.595137996701,null,128.52595137996701,null,null,154.23114165596041,"WIN",{"$f":"IF(COUNTA($F$6:$F$10)=5,(F105-F24)/F24,\"\")","v":0.30068262796526612},1,"new",null,null,null,null,null,null,null,{"$f":"IF(AND(L104=\"WIN\",L105<>\"WIN\"),SUMIF(L$24:L104,\"WIN\",K$24:K104)-SUM(W$23:W103),\"\")","v":""},{"$f":"IF(AND(L104=\"LOSS\",L105<>\"LOSS\"),SUMIF(L$24:L104,\"LOSS\",K$24:K104)-SUM(X$23:X103),\"\")","v":""}]
[null,"Row 105 (82)",null,21,null,13006.826279652661,null,130.06826279652662,null,null,156.08191535583194,"WIN",{"$f":"IF(COUNTA($F$6:$F$10)=5,(F106-F24)/F24,\"\")","v":0.31629081950084931},2,"last",null,null,null,null,null,null,null,{"$f":"IF(AND(L105=\"WIN\",L106<>\"WIN\"),SUMIF(L$24:L105,\"WIN\",K$24:K105)-SUM(W$23:W104),\"\")","v":310.31305701179281},{"$f":"IF(AND(L105=\"LOSS\",L106<>\"LOSS\"),SUMIF(L$24:L105,\"LOSS\",K$24:K105)-SUM(X$23:X104),\"\")","v":""}]
[null,"Row 106 (83)",null,65,null,13162.908195008493,null,131.62908195008492,null,null,-131.62908195008492,"LOSS",{"$f":"IF(COUNTA($F$6:$F$10)=5,(F107-F24)/F24,\"\")","v":0.30312791130584082},1,"last",null,null,null,null,null,null,null,{"$f":"IF(AND(L106=\"WIN\",L107<>\"WIN\"),SUMIF(L$24:L106,\"WIN\",K$24:K106)-SUM(W$23:W105),\"\")","v":""},{"$f":"IF(AND(L106=\"LOSS\",L107<>\"LOSS\"),SUMIF(L$24:L106,\"LOSS\",K$24:K106)-SUM(X$23:X105),\"\")","v":-131.62908195008504}]
[null,"Row 107 (84)",null,36,null,13031.279113058408,null,130.31279113058409,null,null,156.37534935670089,"WIN",{"$f":"IF(COUNTA($F$6:$F$10)=5,(F108-F24)/F24,\"\")","v":0.31876544624151104},1,"last",null,null,null,null,null,null,null,{"$f":"IF(AND(L107=\"WIN\",L108<>\"WIN\"),SUMIF(L$24:L107,\"WIN\",K$24:K107)-SUM(W$23:W106),\"\")","v":156.37534935670101},{"$f":"IF(AND(L107=\"LOSS\",L108<>\"LOSS\"),SUMIF(L$24:L107,\"LOSS\",K$24:K107)-SUM(X$23:X106),\"\")","v":""}]
[null,"Row 108 (85)",null,87,null,13187.65446241511,null,131.87654462415111,null,null,-131.87654462415111,"LOSS",{"$f":"IF(COUNTA($F$6:$F$10)=5,(F109-F24)/F24,\"\")","v":0.30557779177909594},1,"last",null,null,null,null,null,null,null,{"$f":"IF(AND(L108=\"WIN\",L109<>\"WIN\"),SUMIF(L$24:L108,\"WIN\",K$24:K108)-SUM(W$23:W107),\"\")","v":""},{"$f":"IF(AND(L108=\"LOSS\",L109<>\"LOSS\"),SUMIF(L$24:L108,\"LOSS\",K$24:K108)-SUM(X$23:X107),\"\")","v":-131.87654462415094}]
[null,"Row 109 (86)",null,7,null,13055.77791779096,null,130.55777917790959,null,null,156.66933501349152,"WIN",{"$f":"IF(COUNTA($F$6:$F$10)=5,(F110-F24)/F24,\"\")","v":0.32124472528044518},1,"new",null,null,null,null,null,null,null,{"$f":"IF(AND(L109=\"WIN\",L110<>\"WIN\"),SUMIF(L$24:L109,\"WIN\",K$24:K109)-SUM(W$23:W108),\"\")","v":""},{"$f":"IF(AND(L109=\"LOSS\",L110<>\"LOSS\"),SUMIF(L$24:L109,\"LOSS\",K$24:K109)-SUM(X$23:X108),\"\")","v":""}]
[null,"Row 110 (87)",null,30,null,13212.447252804452,null,132.12447252804452,null,null,158.54936703365343,"WIN",{"$f":"IF(COUNTA($F$6:$F$10)=5,(F111-F24)/F24,\"\")","v":0.33709966198381042},2,"last",null,null,null,null,null,null,null,{"$f":"IF(AND(L110=\"WIN\",L111<>\"WIN\"),SUMIF(L$24:L110,\"WIN\",K$24:K110)-SUM(W$23:W109),\"\")","v":315.2187020471456},{"$f":"IF(AND(L110=\"LOSS\",L111<>\"LOSS\"),SUMIF(L$24:L110,\"LOSS\",K$24:K110)-SUM(X$23:X109),\"\")","v":""}]
[null,"Row 111 (88)",null,76,null,13370.996619838104,null,133.70996619838104,null,null,-133.70996619838104,"LOSS",{"$f":"IF(COUNTA($F$6:$F$10)=5,(F112-F24)/F24,\"\")","v":0.32372866536397232},1,"last",null,null,null,null,null,null,null,{"$f":"IF(AND(L111=\"WIN\",L112<>\"WIN\"),SUMIF(L$24:L111,\"WIN\",K$24:K111)-SUM(W$23:W110),\"\")","v":""},{"$f":"IF(AND(L111=\"LOSS\",L112<>\"LOSS\"),SUMIF(L$24:L111,\"LOSS\",K$24:K111)-SUM(X$23:X110),\"\")","v":-133.7099661983807}]
[null,"Row 112 (89)",null,37,null,13237.286653639723,null,132.37286653639723,null,null,158.84743984367665,"WIN",{"$f":"IF(COUNTA($F$6:$F$10)=5,(F113-F24)/F24,\"\")","v":0.33961340934834006},1,"last",null,null,null,null,null,null,null,{"$f":"IF(AND(L112=\"WIN\",L113<>\"WIN\"),SUMIF(L$24:L112,\"WIN\",K$24:K112)-SUM(W$23:W111),\"\")","v":158.84743984367651},{"$f":"IF(AND(L112=\"LOSS\",L113<>\"LOSS\"),SUMIF(L$24:L112,\"LOSS\",K$24:K112)-SUM(X$23:X111),\"\")","v":""}]
[null,"Row 113 (90)",null,72,null,13396.134093483401,null,133.961340934834,null,null,-133.961340934834,"LOSS",{"$f":"IF(COUNTA($F$6:$F$10)=5,(F114-F24)/F24,\"\")","v":0.32621727525485655},1,"last",null,null,null,null,null,null,null,{"$f":"IF(AND(L113=\"WIN\",L114<>\"WIN\"),SUMIF(L$24:L113,\"WIN\",K$24:K113)-SUM(W$23:W112),\"\")","v":""},{"$f":"IF(AND(L113=\"LOSS\",L114<>\"LOSS\"),SUMIF(L$24:L113,\"LOSS\",K$24:K113)-SUM(X$23:X112),\"\")","v":-133.96134093483397}]
[null,"Row 114 (91)",null,9,null,13262.172752548566,null,132.62172752548565,null,null,159.14607303058278,"WIN",{"$f":"IF(COUNTA($F$6:$F$10)=5,(F115-F24)/F24,\"\")","v":0.34213188255791482},1,"last",null,null,null,null,null,null,null,{"$f":"IF(AND(L114=\"WIN\",L115<>\"WIN\"),SUMIF(L$24:L114,\"WIN\",K$24:K114)-SUM(W$23:W113),\"\")","v":159.14607303058256},{"$f":"IF(AND(L114=\"LOSS\",L115<>\"LOSS\"),SUMIF(L$24:L114,\"LOSS\",K$24:K114)-SUM(X$23:X113),\"\")","v":""}]
[null,"Row 115 (92)",null,74,null,13421.318825579148,null,134.21318825579149,null,null,-134.21318825579149,"LOSS",{"$f":"IF(COUNTA($F$6:$F$10)=5,(F116-F24)/F24,\"\")","v":0.3287105637323357},1,"last",null,null,null,null,null,null,null,{"$f":"IF(AND(L115=\"WIN\",L116<>\"WIN\"),SUMIF(L$24:L115,\"WIN\",K$24:K115)-SUM(W$23:W114),\"\")","v":""},{"$f":"IF(AND(L115=\"LOSS\",L116<>\"LOSS\"),SUMIF(L$24:L115,\"LOSS\",K$24:K115)-SUM(X$23:X114),\"\")","v":-134.21318825579147}]
[null,"Row 116 (93)",null,35,null,13287.105637323357,null,132.87105637323356,null,null,159.44526764788026,"WIN",{"$f":"IF(COUNTA($F$6:$F$10)=5,(F117-F24)/F24,\"\")","v":0.34465509049712362},1,"new",null,null,null,null,null,null,null,{"$f":"IF(AND(L116=\"WIN\",L117<>\"WIN\"),SUMIF(L$24:L116,\"WIN\",K$24:K116)-SUM(W$23:W115),\"\")","v":""},{"$f":"IF(AND(L116=\"LOSS\",L117<>\"LOSS\"),SUMIF(L$24:L116,\"LOSS\",K$24:K116)-SUM(X$23:X115),\"\")","v":""}]
[null,"Row 117 (94)",null,18,null,13446.550904971236,null,134.46550904971235,null,null,161.35861085965482,"WIN",{"$f":"IF(COUNTA($F$6:$F$10)=5,(F118-F24)/F24,\"\")","v":0.36079095158308921},2,"last",null,null,null,null,null,null,null,{"$f":"IF(AND(L117=\"WIN\",L118<>\"WIN\"),SUMIF(L$24:L117,\"WIN\",K$24:K117)-SUM(W$23:W116),\"\")","v":320.80387850753505},{"$f":"IF(AND(L117=\"LOSS\",L118<>\"LOSS\"),SUMIF(L$24:L117,\"LOSS\",K$24:K117)-SUM(X$23:X116),\"\")","v":""}]
[null,"Row 118 (95)",null,61,null,13607.909515830892,null,136.07909515830892,null,null,-136.07909515830892,"LOSS",{"$f":"IF(COUNTA($F$6:$F$10)=5,(F119-F24)/F24,\"\")","v":0.34718304206725825},1,"last",null,null,null,null,null,null,null,{"$f":"IF(AND(L118=\"WIN\",L119<>\"WIN\"),SUMIF(L$24:L118,\"WIN\",K$24:K118)-SUM(W$23:W117),\"\")","v":""},{"$f":"IF(AND(L118=\"LOSS\",L119<>\"LOSS\"),SUMIF(L$24:L118,\"LOSS\",K$24:K118)-SUM(X$23:X117),\"\")","v":-136.07909515830852}]
[null,"Row 119 (96)",null,22,null,13471.830420672582,null,134.71830420672583,null,null,161.66196504807098,"WIN",{"$f":"IF(COUNTA($F$6:$F$10)=5,(F120-F24)/F24,\"\")","v":0.36334923857206541},1,"last",null,null,null,null,null,null,null,{"$f":"IF(AND(L119=\"WIN\",L120<>\"WIN\"),SUMIF(L$24:L119,\"WIN\",K$24:K119)-SUM(W$23:W118),\"\")","v":161.66196504807067},{"$f":"IF(AND(L119=\"LOSS\",L120<>\"LOSS\"),SUMIF(L$24:L119,\"LOSS\",K$24:K119)-SUM(X$23:X118),\"\")","v":""}]
[null,"Row 120 (97)",null,59,null,13633.492385720654,null,136.33492385720655,null,null,-136.33492385720655,"LOSS",{"$f":"IF(COUNTA($F$6:$F$10)=5,(F121-F24)/F24,\"\")","v":0.34971574618634477},1,"new",null,null,null,null,null,null,null,{"$f":"IF(AND(L120=\"WIN\",L121<>\"WIN\"),SUMIF(L$24:L120,\"WIN\",K$24:K120)-SUM(W$23:W119),\"\")","v":""},{"$f":"IF(AND(L120=\"LOSS\",L121<>\"LOSS\"),SUMIF(L$24:L120,\"LOSS\",K$24:K120)-SUM(X$23:X119),\"\")","v":""}]
[null,"Row 121 (98)",null,87,null,13497.157461863448,null,134.97157461863449,null,null,-134.97157461863449,"LOSS",{"$f":"IF(COUNTA($F$6:$F$10)=5,(F122-F24)/F24,\"\")","v":0.3362185887244814},2,"middle",null,null,null,null,null,null,null,{"$f":"IF(AND(L121=\"WIN\",L122<>\"WIN\"),SUMIF(L$24:L121,\"WIN\",K$24:K121)-SUM(W$23:W120),\"\")","v":""},{"$f":"IF(AND(L121=\"LOSS\",L122<>\"LOSS\"),SUMIF(L$24:L121,\"LOSS\",K$24:K121)-SUM(X$23:X120),\"\")","v":""}]
[null,"Row 122 (99)",null,79,null,13362.185887244814,null,133.62185887244814,null,null,-133.62185887244814,"LOSS",{"$f":"IF(COUNTA($F$6:$F$10)=5,(F123-F24)/F24,\"\")","v":0.3228564028372366},3,"last",null,null,null,null,null,null,null,{"$f":"IF(AND(L122=\"WIN\",L123<>\"WIN\"),SUMIF(L$24:L122,\"WIN\",K$24:K122)-SUM(W$23:W121),\"\")","v":""},{"$f":"IF(AND(L122=\"LOSS\",L123<>\"LOSS\"),SUMIF(L$24:L122,\"LOSS\",K$24:K122)-SUM(X$23:X121),\"\")","v":-404.92835734828896}]
[null,"Row 123 (100)",null,1,null,13228.564028372366,null,132.28564028372367,null,null,158.74276834046839,"WIN",{"$f":"IF(COUNTA($F$6:$F$10)=5,(F124-F24)/F24,\"\")","v":0.33873067967128356},1,"last",null,null,null,null,null,null,null,{"$f":"IF(AND(L123=\"WIN\",L124<>\"WIN\"),SUMIF(L$24:L123,\"WIN\",K$24:K123)-SUM(W$23:W122),\"\")","v":158.74276834046759},{"$f":"IF(AND(L123=\"LOSS\",L124<>\"LOSS\"),SUMIF(L$24:L123,\"LOSS\",K$24:K123)-SUM(X$23:X122),\"\")","v":""}]
[null,"Row 124 (101)",null,74,null,13387.306796712835,null,133.87306796712835,null,null,-133.87306796712835,"LOSS",{"$f":"IF(COUNTA($F$6:$F$10)=5,(F125-F24)/F24,\"\")","v":0.32534337287457077},1,"last",null,null,null,null,null,null,null,{"$f":"IF(AND(L124=\"WIN\",L125<>\"WIN\"),SUMIF(L$24:L124,\"WIN\",K$24:K124)-SUM(W$23:W123),\"\")","v":""},{"$f":"IF(AND(L124=\"LOSS\",L125<>\"LOSS\"),SUMIF(L$24:L124,\"LOSS\",K$24:K124)-SUM(X$23:X123),\"\")","v":-133.87306796712801}]
[null,"Row 125 (102)",null,32,null,13253.433728745707,null,132.53433728745708,null,null,159.04120474494849,"WIN",{"$f":"IF(COUNTA($F$6:$F$10)=5,(F126-F24)/F24,\"\")","v":0.34124749334906557},1,"new",null,null,null,null,null,null,null,{"$f":"IF(AND(L125=\"WIN\",L126<>\"WIN\"),SUMIF(L$24:L125,\"WIN\",K$24:K125)-SUM(W$23:W124),\"\")","v":""},{"$f":"IF(AND(L125=\"LOSS\",L126<>\"LOSS\"),SUMIF(L$24:L125,\"LOSS\",K$24:K125)-SUM(X$23:X124),\"\")","v":""}]
[null,"Row 126 (103)",null,2,null,13412.474933490656,null,134.12474933490657,null,null,160.94969920188788,"WIN",{"$f":"IF(COUNTA($F$6:$F$10)=5,(F127-F24)/F24,\"\")","v":0.3573424632692544},2,"middle",null,null,null,null,null,null,null,{"$f":"IF(AND(L126=\"WIN\",L127<>\"WIN\"),SUMIF(L$24:L126,\"WIN\",K$24:K126)-SUM(W$23:W125),\"\")","v":""},{"$f":"IF(AND(L126=\"LOSS\",L127<>\"LOSS\"),SUMIF(L$24:L126,\"LOSS\",K$24:K126)-SUM(X$23:X125),\"\")","v":""}]
[null,"Row 127 (104)",null,13,null,13573.424632692544,null,135.73424632692544,null,null,162.88109559231052,"WIN",{"$f":"IF(COUNTA($F$6:$F$10)=5,(F128-F24)/F24,\"\")","v":0.3736305728284855},3,"middle",null,null,null,null,null,null,null,{"$f":"IF(AND(L127=\"WIN\",L128<>\"WIN\"),SUMIF(L$24:L127,\"WIN\",K$24:K127)-SUM(W$23:W126),\"\")","v":""},{"$f":"IF(AND(L127=\"LOSS\",L128<>\"LOSS\"),SUMIF(L$24:L127,\"LOSS\",K$24:K127)-SUM(X$23:X126),\"\")","v":""}]
[null,"Row 128 (105)",null,14,null,13736.305728284855,null,137.36305728284856,null,null,164.83566873941825,"WIN",{"$f":"IF(COUNTA($F$6:$F$10)=5,(F129-F24)/F24,\"\")","v":0.39011413970242736},4,"last",null,null,null,null,null,null,null,{"$f":"IF(AND(L128=\"WIN\",L129<>\"WIN\"),SUMIF(L$24:L128,\"WIN\",K$24:K128)-SUM(W$23:W127),\"\")","v":647.70766827856642},{"$f":"IF(AND(L128=\"LOSS\",L129<>\"LOSS\"),SUMIF(L$24:L128,\"LOSS\",K$24:K128)-SUM(X$23:X127),\"\")","v":""}]
[null,"Row 129 (106)",null,85,null,13901.141397024274,null,139.01141397024273,null,null,-139.01141397024273,"LOSS",{"$f":"IF(COUNTA($F$6:$F$10)=5,(F130-F24)/F24,\"\")","v":0.376212998305403},1,"new",null,null,null,null,null,null,null,{"$f":"IF(AND(L129=\"WIN\",L130<>\"WIN\"),SUMIF(L$24:L129,\"WIN\",K$24:K129)-SUM(W$23:W128),\"\")","v":""},{"$f":"IF(AND(L129=\"LOSS\",L130<>\"LOSS\"),SUMIF(L$24:L129,\"LOSS\",K$24:K129)-SUM(X$23:X128),\"\")","v":""}]
[null,"Row 130 (107)",null,66,null,13762.12998305403,null,137.62129983054029,null,null,-137.62129983054029,"LOSS",{"$f":"IF(COUNTA($F$6:$F$10)=5,(F131-F24)/F24,\"\")","v":0.36245086832234902},2,"middle",null,null,null,null,null,null,null,{"$f":"IF(AND(L130=\"WIN\",L131<>\"WIN\"),SUMIF(L$24:L130,\"WIN\",K$24:K130)-SUM(W$23:W129),\"\")","v":""},{"$f":"IF(AND(L130=\"LOSS\",L131<>\"LOSS\"),SUMIF(L$24:L130,\"LOSS\",K$24:K130)-SUM(X$23:X129),\"\")","v":""}]
[null,"Row 131 (108)",null,71,null,13624.50868322349,null,136.2450868322349,null,null,-136.2450868322349,"LOSS",{"$f":"IF(COUNTA($F$6:$F$10)=5,(F132-F24)/F24,\"\")","v":0.34882635963912545},3,"middle",null,null,null,null,null,null,null,{"$f":"IF(AND(L131=\"WIN\",L132<>\"WIN\"),SUMIF(L$24:L131,\"WIN\",K$24:K131)-SUM(W$23:W130),\"\")","v":""},{"$f":"IF(AND(L131=\"LOSS\",L132<>\"LOSS\"),SUMIF(L$24:L131,\"LOSS\",K$24:K131)-SUM(X$23:X130),\"\")","v":""},null,"Distribution and Reprint Policy"]
[null,"Row 132 (109)",null,99,null,13488.263596391254,null,134.88263596391255,null,null,-134.88263596391255,"LOSS",{"$f":"IF(COUNTA($F$6:$F$10)=5,(F133-F24)/F24,\"\")","v":0.33533809604273412},4,"last",null,null,null,null,null,null,null,{"$f":"IF(AND(L132=\"WIN\",L133<>\"WIN\"),SUMIF(L$24:L132,\"WIN\",K$24:K132)-SUM(W$23:W131),\"\")","v":""},{"$f":"IF(AND(L132=\"LOSS\",L133<>\"LOSS\"),SUMIF(L$24:L132,\"LOSS\",K$24:K132)-SUM(X$23:X131),\"\")","v":-547.76043659693005},null,"This document maybe be republished and distributed under the proviso that it cannot be altered or amended."]
[null,"Row 133 (110)",null,11,null,13353.380960427341,null,133.53380960427342,null,null,160.2405715251281,"WIN",{"$f":"IF(COUNTA($F$6:$F$10)=5,(F134-F24)/F24,\"\")","v":0.35136215319524688},1,"new",null,null,null,null,null,null,null,{"$f":"IF(AND(L133=\"WIN\",L134<>\"WIN\"),SUMIF(L$24:L133,\"WIN\",K$24:K133)-SUM(W$23:W132),\"\")","v":""},{"$f":"IF(AND(L133=\"LOSS\",L134<>\"LOSS\"),SUMIF(L$24:L133,\"LOSS\",K$24:K133)-SUM(X$23:X132),\"\")","v":""},null,"DayTradingLife.com Reserve all rights to this effect. "]
[null,"Row 134 (111)",null,34,null,13513.621531952469,null,135.13621531952469,null,null,162.16345838342963,"WIN",{"$f":"IF(COUNTA($F$6:$F$10)=5,(F135-F24)/F24,\"\")","v":0.36757849903358986},2,"middle",null,null,null,null,null,null,null,{"$f":"IF(AND(L134=\"WIN\",L135<>\"WIN\"),SUMIF(L$24:L134,\"WIN\",K$24:K134)-SUM(W$23:W133),\"\")","v":""},{"$f":"IF(AND(L134=\"LOSS\",L135<>\"LOSS\"),SUMIF(L$24:L134,\"LOSS\",K$24:K134)-SUM(X$23:X133),\"\")","v":""},null,null,"For any futher information please email me at: ",null,null,null,null,null,null,"traderdowboy@gmail.com"]
[null,"Row 135 (112)",null,24,null,13675.784990335898,null,136.75784990335899,null,null,164.10941988403079,"WIN",{"$f":"IF(COUNTA($F$6:$F$10)=5,(F136-F24)/F24,\"\")","v":0.38398944102199295},3,"last",null,null,null,null,null,null,null,{"$f":"IF(AND(L135=\"WIN\",L136<>\"WIN\"),SUMIF(L$24:L135,\"WIN\",K$24:K135)-SUM(W$23:W134),\"\")","v":486.51344979258829},{"$f":"IF(AND(L135=\"LOSS\",L136<>\"LOSS\"),SUMIF(L$24:L135,\"LOSS\",K$24:K135)-SUM(X$23:X134),\"\")","v":""},null,"Copyright © 2011-2012 - DayTradingLife.com. - All rights reserved."]
[null,"Row 136 (113)",null,70,null,13839.894410219929,null,138.39894410219929,null,null,-138.39894410219929,"LOSS",{"$f":"IF(COUNTA($F$6:$F$10)=5,(F137-F24)/F24,\"\")","v":0.37014954661177307},1,"last",null,null,null,null,null,null,null,{"$f":"IF(AND(L136=\"WIN\",L137<>\"WIN\"),SUMIF(L$24:L136,\"WIN\",K$24:K136)-SUM(W$23:W135),\"\")","v":""},{"$f":"IF(AND(L136=\"LOSS\",L137<>\"LOSS\"),SUMIF(L$24:L136,\"LOSS\",K$24:K136)-SUM(X$23:X135),\"\")","v":-138.39894410219949}]
[null,"Row 137 (114)",null,21,null,13701.495466117731,null,137.01495466117731,null,null,164.41794559341278,"WIN",{"$f":"IF(COUNTA($F$6:$F$10)=5,(F138-F24)/F24,\"\")","v":0.38659134117111443},1,"last",null,null,null,null,null,null,null,{"$f":"IF(AND(L137=\"WIN\",L138<>\"WIN\"),SUMIF(L$24:L137,\"WIN\",K$24:K137)-SUM(W$23:W136),\"\")","v":164.41794559341361},{"$f":"IF(AND(L137=\"LOSS\",L138<>\"LOSS\"),SUMIF(L$24:L137,\"LOSS\",K$24:K137)-SUM(X$23:X136),\"\")","v":""}]
[null,"Row 138 (115)",null,96,null,13865.913411711144,null,138.65913411711145,null,null,-138.65913411711145,"LOSS",{"$f":"IF(COUNTA($F$6:$F$10)=5,(F139-F24)/F24,\"\")","v":0.37272542775940326},1,"new",null,null,null,null,null,null,null,{"$f":"IF(AND(L138=\"WIN\",L139<>\"WIN\"),SUMIF(L$24:L138,\"WIN\",K$24:K138)-SUM(W$23:W137),\"\")","v":""},{"$f":"IF(AND(L138=\"LOSS\",L139<>\"LOSS\"),SUMIF(L$24:L138,\"LOSS\",K$24:K138)-SUM(X$23:X137),\"\")","v":""}]
[null,"Row 139 (116)",null,63,null,13727.254277594033,null,137.27254277594034,null,null,-137.27254277594034,"LOSS",{"$f":"IF(COUNTA($F$6:$F$10)=5,(F140-F24)/F24,\"\")","v":0.35899817348180929},2,"last",null,null,null,null,null,null,null,{"$f":"IF(AND(L139=\"WIN\",L140<>\"WIN\"),SUMIF(L$24:L139,\"WIN\",K$24:K139)-SUM(W$23:W138),\"\")","v":""},{"$f":"IF(AND(L139=\"LOSS\",L140<>\"LOSS\"),SUMIF(L$24:L139,\"LOSS\",K$24:K139)-SUM(X$23:X138),\"\")","v":-275.9316768930521}]
[null,"Row 140 (117)",null,47,null,13589.981734818093,null,135.89981734818093,null,null,163.07978081781712,"WIN",{"$f":"IF(COUNTA($F$6:$F$10)=5,(F141-F24)/F24,\"\")","v":0.37530615156359109},1,"new",null,null,null,null,null,null,null,{"$f":"IF(AND(L140=\"WIN\",L141<>\"WIN\"),SUMIF(L$24:L140,\"WIN\",K$24:K140)-SUM(W$23:W139),\"\")","v":""},{"$f":"IF(AND(L140=\"LOSS\",L141<>\"LOSS\"),SUMIF(L$24:L140,\"LOSS\",K$24:K140)-SUM(X$23:X139),\"\")","v":""}]
[null,"Row 141 (118)",null,39,null,13753.061515635911,null,137.53061515635912,null,null,165.03673818763093,"WIN",{"$f":"IF(COUNTA($F$6:$F$10)=5,(F142-F24)/F24,\"\")","v":0.3918098253823542},2,"middle",null,null,null,null,null,null,null,{"$f":"IF(AND(L141=\"WIN\",L142<>\"WIN\"),SUMIF(L$24:L141,\"WIN\",K$24:K141)-SUM(W$23:W140),\"\")","v":""},{"$f":"IF(AND(L141=\"LOSS\",L142<>\"LOSS\"),SUMIF(L$24:L141,\"LOSS\",K$24:K141)-SUM(X$23:X140),\"\")","v":""}]
[null,"Row 142 (119)",null,46,null,13918.098253823542,null,139.18098253823541,null,null,167.0171790458825,"WIN",{"$f":"IF(COUNTA($F$6:$F$10)=5,(F143-F24)/F24,\"\")","v":0.40851154328694245},3,"last",null,null,null,null,null,null,null,{"$f":"IF(AND(L142=\"WIN\",L143<>\"WIN\"),SUMIF(L$24:L142,\"WIN\",K$24:K142)-SUM(W$23:W141),\"\")","v":495.13369805133152},{"$f":"IF(AND(L142=\"LOSS\",L143<>\"LOSS\"),SUMIF(L$24:L142,\"LOSS\",K$24:K142)-SUM(X$23:X141),\"\")","v":""}]
[null,"Row 143 (120)",null,74,null,14085.115432869425,null,140.85115432869426,null,null,-140.85115432869426,"LOSS",{"$f":"IF(COUNTA($F$6:$F$10)=5,(F144-F24)/F24,\"\")","v":0.39442642785407295},1,"last",null,null,null,null,null,null,null,{"$f":"IF(AND(L143=\"WIN\",L144<>\"WIN\"),SUMIF(L$24:L143,\"WIN\",K$24:K143)-SUM(W$23:W142),\"\")","v":""},{"$f":"IF(AND(L143=\"LOSS\",L144<>\"LOSS\"),SUMIF(L$24:L143,\"LOSS\",K$24:K143)-SUM(X$23:X142),\"\")","v":-140.85115432869407}]
[null,"Row 144 (121)",null,25,null,13944.26427854073,null,139.44264278540729,null,null,167.33117134248874,"WIN",{"$f":"IF(COUNTA($F$6:$F$10)=5,(F145-F24)/F24,\"\")","v":0.4111595449883218},1,"new",null,null,null,null,null,null,null,{"$f":"IF(AND(L144=\"WIN\",L145<>\"WIN\"),SUMIF(L$24:L144,\"WIN\",K$24:K144)-SUM(W$23:W143),\"\")","v":""},{"$f":"IF(AND(L144=\"LOSS\",L145<>\"LOSS\"),SUMIF(L$24:L144,\"LOSS\",K$24:K144)-SUM(X$23:X143),\"\")","v":""}]
[null,"Row 145 (122)",null,9,null,14111.595449883218,null,141.1159544988322,null,null,169.33914539859862,"WIN",{"$f":"IF(COUNTA($F$6:$F$10)=5,(F146-F24)/F24,\"\")","v":0.42809345952818167},2,"middle",null,null,null,null,null,null,null,{"$f":"IF(AND(L145=\"WIN\",L146<>\"WIN\"),SUMIF(L$24:L145,\"WIN\",K$24:K145)-SUM(W$23:W144),\"\")","v":""},{"$f":"IF(AND(L145=\"LOSS\",L146<>\"LOSS\"),SUMIF(L$24:L145,\"LOSS\",K$24:K145)-SUM(X$23:X144),\"\")","v":""}]
[null,"Row 146 (123)",null,8,null,14280.934595281817,null,142.80934595281818,null,null,171.37121514338182,"WIN",{"$f":"IF(COUNTA($F$6:$F$10)=5,(F147-F24)/F24,\"\")","v":0.44523058104251978},3,"last",null,null,null,null,null,null,null,{"$f":"IF(AND(L146=\"WIN\",L147<>\"WIN\"),SUMIF(L$24:L146,\"WIN\",K$24:K146)-SUM(W$23:W145),\"\")","v":508.04153188446799},{"$f":"IF(AND(L146=\"LOSS\",L147<>\"LOSS\"),SUMIF(L$24:L146,\"LOSS\",K$24:K146)-SUM(X$23:X145),\"\")","v":""}]
[null,"Row 147 (124)",null,79,null,14452.305810425198,null,144.52305810425199,null,null,-144.52305810425199,"LOSS",{"$f":"IF(COUNTA($F$6:$F$10)=5,(F148-F24)/F24,\"\")","v":0.43077827523209455},1,"new",null,null,null,null,null,null,null,{"$f":"IF(AND(L147=\"WIN\",L148<>\"WIN\"),SUMIF(L$24:L147,\"WIN\",K$24:K147)-SUM(W$23:W146),\"\")","v":""},{"$f":"IF(AND(L147=\"LOSS\",L148<>\"LOSS\"),SUMIF(L$24:L147,\"LOSS\",K$24:K147)-SUM(X$23:X146),\"\")","v":""}]
[null,"Row 148 (125)",null,69,null,14307.782752320945,null,143.07782752320946,null,null,-143.07782752320946,"LOSS",{"$f":"IF(COUNTA($F$6:$F$10)=5,(F149-F24)/F24,\"\")","v":0.41647049247977358},2,"last",null,null,null,null,null,null,null,{"$f":"IF(AND(L148=\"WIN\",L149<>\"WIN\"),SUMIF(L$24:L148,\"WIN\",K$24:K148)-SUM(W$23:W147),\"\")","v":""},{"$f":"IF(AND(L148=\"LOSS\",L149<>\"LOSS\"),SUMIF(L$24:L148,\"LOSS\",K$24:K148)-SUM(X$23:X147),\"\")","v":-287.60088562746205}]
[null,"Row 149 (126)",null,53,null,14164.704924797736,null,141.64704924797735,null,null,169.97645909757281,"WIN",{"$f":"IF(COUNTA($F$6:$F$10)=5,(F150-F24)/F24,\"\")","v":0.43346813838953097},1,"last",null,null,null,null,null,null,null,{"$f":"IF(AND(L149=\"WIN\",L150<>\"WIN\"),SUMIF(L$24:L149,\"WIN\",K$24:K149)-SUM(W$23:W148),\"\")","v":169.97645909757193},{"$f":"IF(AND(L149=\"LOSS\",L150<>\"LOSS\"),SUMIF(L$24:L149,\"LOSS\",K$24:K149)-SUM(X$23:X148),\"\")","v":""}]
[null,"Row 150 (127)",null,95,null,14334.681383895309,null,143.3468138389531,null,null,-143.3468138389531,"LOSS",{"$f":"IF(COUNTA($F$6:$F$10)=5,(F151-F24)/F24,\"\")","v":0.4191334570056357},1,"last",null,null,null,null,null,null,null,{"$f":"IF(AND(L150=\"WIN\",L151<>\"WIN\"),SUMIF(L$24:L150,\"WIN\",K$24:K150)-SUM(W$23:W149),\"\")","v":""},{"$f":"IF(AND(L150=\"LOSS\",L151<>\"LOSS\"),SUMIF(L$24:L150,\"LOSS\",K$24:K150)-SUM(X$23:X149),\"\")","v":-143.34681383895349}]
[null,"Row 151 (128)",null,31,null,14191.334570056357,null,141.91334570056358,null,null,170.29601484067629,"WIN",{"$f":"IF(COUNTA($F$6:$F$10)=5,(F152-F24)/F24,\"\")","v":0.43616305848970333},1,"last",null,null,null,null,null,null,null,{"$f":"IF(AND(L151=\"WIN\",L152<>\"WIN\"),SUMIF(L$24:L151,\"WIN\",K$24:K151)-SUM(W$23:W150),\"\")","v":170.29601484067643},{"$f":"IF(AND(L151=\"LOSS\",L152<>\"LOSS\"),SUMIF(L$24:L151,\"LOSS\",K$24:K151)-SUM(X$23:X150),\"\")","v":""}]
[null,"Row 152 (129)",null,92,null,14361.630584897033,null,143.61630584897034,null,null,-143.61630584897034,"LOSS",{"$f":"IF(COUNTA($F$6:$F$10)=5,(F153-F24)/F24,\"\")","v":0.42180142790480624},1,"new",null,null,null,null,null,null,null,{"$f":"IF(AND(L152=\"WIN\",L153<>\"WIN\"),SUMIF(L$24:L152,\"WIN\",K$24:K152)-SUM(W$23:W151),\"\")","v":""},{"$f":"IF(AND(L152=\"LOSS\",L153<>\"LOSS\"),SUMIF(L$24:L152,\"LOSS\",K$24:K152)-SUM(X$23:X151),\"\")","v":""}]
[null,"Row 153 (130)",null,66,null,14218.014279048062,null,{"$f":"IF(COUNTBLANK($F$6:$F$10),\"\",F153*$F$7)","v":142.18014279048063},null,null,-142.18014279048063,{"$f":"IF(D153=\"\",\"\",IF(D153<$F$8,\"WIN\",\"LOSS\"))","v":"LOSS"},{"$f":"IF(COUNTA($F$6:$F$10)=5,(F154-F24)/F24,\"\")","v":0.40758341362575812},{"$f":"IF(L153=L152,N152+1,1)","v":2},{"$f":"IF(N153=1,IF(N154=1,\"last\",\"new\"),IF(N154=1,\"last\",\"middle\"))","v":"middle"},null,null,null,null,null,null,null,{"$f":"IF(AND(L153=\"WIN\",L154<>\"WIN\"),SUMIF(L$24:L153,\"WIN\",K$24:K153)-SUM(W$23:W152),\"\")","v":""},{"$f":"IF(AND(L153=\"LOSS\",L154<>\"LOSS\"),SUMIF(L$24:L153,\"LOSS\",K$24:K153)-SUM(X$23:X152),\"\")","v":""}]
[null,"Row 154 (131)",null,89,null,{"$f":"IF(COUNTBLANK($F$6:$F$10),\"\",IF(D153<$F$8,(1+$F$7*$F$9)*F153-$F$10,(1-$F$7)*F153-$F$10))","v":14075.834136257581},null,140.75834136257581,null,null,{"$f":"IF(COUNTBLANK($F$6:$F$10),\"\", IF(L154=\"win\", H154*$F$9-$F$10, IF(L154=\"loss\", -H154-$F$10)))","v":-140.75834136257581},"LOSS",{"$f":"IF(COUNTA($F$6:$F$10)=5,(F155-F24)/F24,\"\")","v":0.39350757948950049},3,"last",null,null,null,null,null,null,null,{"$f":"IF(AND(L154=\"WIN\",L155<>\"WIN\"),SUMIF(L$24:L154,\"WIN\",K$24:K154)-SUM(W$23:W153),\"\")","v":""},{"$f":"IF(AND(L154=\"LOSS\",L155<>\"LOSS\"),SUMIF(L$24:L154,\"LOSS\",K$24:K154)-SUM(X$23:X153),\"\")","v":-426.55479000202649}]
[null,"Row 155 (132)",null,24,null,13935.075794895005,null,139.35075794895005,null,null,167.22090953874005,"WIN",{"$f":"IF(COUNTA($F$6:$F$10)=5,(F156-F24)/F24,\"\")","v":0.41022967044337455},1,"last",null,null,null,null,null,null,null,{"$f":"IF(AND(L155=\"WIN\",L156<>\"WIN\"),SUMIF(L$24:L155,\"WIN\",K$24:K155)-SUM(W$23:W154),\"\")","v":167.22090953874067},{"$f":"IF(AND(L155=\"LOSS\",L156<>\"LOSS\"),SUMIF(L$24:L155,\"LOSS\",K$24:K155)-SUM(X$23:X154),\"\")","v":""}]
[null,"Row 156 (133)",null,55,null,14102.296704433746,null,141.02296704433746,null,null,-141.02296704433746,"LOSS",{"$f":"IF(COUNTA($F$6:$F$10)=5,(F157-F24)/F24,\"\")","v":0.39612737373894086},1,"new",null,null,null,null,null,null,null,{"$f":"IF(AND(L156=\"WIN\",L157<>\"WIN\"),SUMIF(L$24:L156,\"WIN\",K$24:K156)-SUM(W$23:W155),\"\")","v":""},{"$f":"IF(AND(L156=\"LOSS\",L157<>\"LOSS\"),SUMIF(L$24:L156,\"LOSS\",K$24:K156)-SUM(X$23:X155),\"\")","v":""}]
[null,"Row 157 (134)",null,79,null,13961.273737389409,null,139.61273737389408,null,null,-139.61273737389408,"LOSS",{"$f":"IF(COUNTA($F$6:$F$10)=5,(F158-F24)/F24,\"\")","v":0.38216610000155143},2,"last",null,null,null,null,null,null,null,{"$f":"IF(AND(L157=\"WIN\",L158<>\"WIN\"),SUMIF(L$24:L157,\"WIN\",K$24:K157)-SUM(W$23:W156),\"\")","v":""},{"$f":"IF(AND(L157=\"LOSS\",L158<>\"LOSS\"),SUMIF(L$24:L157,\"LOSS\",K$24:K157)-SUM(X$23:X156),\"\")","v":-280.6357044182314}]
[null,"Row 158 (135)",null,17,null,13821.661000015514,null,138.21661000015516,null,null,165.85993200018618,"WIN",{"$f":"IF(COUNTA($F$6:$F$10)=5,(F159-F24)/F24,\"\")","v":0.39875209320157012},1,"new",null,null,null,null,null,null,null,{"$f":"IF(AND(L158=\"WIN\",L159<>\"WIN\"),SUMIF(L$24:L158,\"WIN\",K$24:K158)-SUM(W$23:W157),\"\")","v":""},{"$f":"IF(AND(L158=\"LOSS\",L159<>\"LOSS\"),SUMIF(L$24:L158,\"LOSS\",K$24:K158)-SUM(X$23:X157),\"\")","v":""}]
[null,"Row 159 (136)",null,30,null,13987.520932015701,null,139.87520932015701,null,null,167.85025118418841,"WIN",{"$f":"IF(COUNTA($F$6:$F$10)=5,(F160-F24)/F24,\"\")","v":0.41553711831998896},2,"last",null,null,null,null,null,null,null,{"$f":"IF(AND(L159=\"WIN\",L160<>\"WIN\"),SUMIF(L$24:L159,\"WIN\",K$24:K159)-SUM(W$23:W158),\"\")","v":333.71018318437564},{"$f":"IF(AND(L159=\"LOSS\",L160<>\"LOSS\"),SUMIF(L$24:L159,\"LOSS\",K$24:K159)-SUM(X$23:X158),\"\")","v":""}]
[null,"Row 160 (137)",null,83,null,14155.37118319989,null,141.5537118319989,null,null,-141.5537118319989,"LOSS",{"$f":"IF(COUNTA($F$6:$F$10)=5,(F161-F24)/F24,\"\")","v":0.40138174713678909},1,"last",null,null,null,null,null,null,null,{"$f":"IF(AND(L160=\"WIN\",L161<>\"WIN\"),SUMIF(L$24:L160,\"WIN\",K$24:K160)-SUM(W$23:W159),\"\")","v":""},{"$f":"IF(AND(L160=\"LOSS\",L161<>\"LOSS\"),SUMIF(L$24:L160,\"LOSS\",K$24:K160)-SUM(X$23:X159),\"\")","v":-141.55371183199895}]
[null,"Row 161 (138)",null,35,null,14013.817471367891,null,140.13817471367892,null,null,168.16580965641469,"WIN",{"$f":"IF(COUNTA($F$6:$F$10)=5,(F162-F24)/F24,\"\")","v":0.41819832810243063},1,"last",null,null,null,null,null,null,null,{"$f":"IF(AND(L161=\"WIN\",L162<>\"WIN\"),SUMIF(L$24:L161,\"WIN\",K$24:K161)-SUM(W$23:W160),\"\")","v":168.16580965641515},{"$f":"IF(AND(L161=\"LOSS\",L162<>\"LOSS\"),SUMIF(L$24:L161,\"LOSS\",K$24:K161)-SUM(X$23:X160),\"\")","v":""}]
[null,"Row 162 (139)",null,87,null,14181.983281024306,null,141.81983281024307,null,null,-141.81983281024307,"LOSS",{"$f":"IF(COUNTA($F$6:$F$10)=5,(F163-F24)/F24,\"\")","v":0.40401634482140636},1,"new",null,null,null,null,null,null,null,{"$f":"IF(AND(L162=\"WIN\",L163<>\"WIN\"),SUMIF(L$24:L162,\"WIN\",K$24:K162)-SUM(W$23:W161),\"\")","v":""},{"$f":"IF(AND(L162=\"LOSS\",L163<>\"LOSS\"),SUMIF(L$24:L162,\"LOSS\",K$24:K162)-SUM(X$23:X161),\"\")","v":""}]
[null,"Row 163 (140)",null,87,null,14040.163448214063,null,140.40163448214065,null,null,-140.40163448214065,"LOSS",{"$f":"IF(COUNTA($F$6:$F$10)=5,(F164-F24)/F24,\"\")","v":0.38997618137319223},2,"middle",null,null,null,null,null,null,null,{"$f":"IF(AND(L163=\"WIN\",L164<>\"WIN\"),SUMIF(L$24:L163,\"WIN\",K$24:K163)-SUM(W$23:W162),\"\")","v":""},{"$f":"IF(AND(L163=\"LOSS\",L164<>\"LOSS\"),SUMIF(L$24:L163,\"LOSS\",K$24:K163)-SUM(X$23:X162),\"\")","v":""}]
[null,"Row 164 (141)",null,61,null,13899.761813731922,null,138.99761813731922,null,null,-138.99761813731922,"LOSS",{"$f":"IF(COUNTA($F$6:$F$10)=5,(F165-F24)/F24,\"\")","v":0.37607641955946036},3,"middle",null,null,null,null,null,null,null,{"$f":"IF(AND(L164=\"WIN\",L165<>\"WIN\"),SUMIF(L$24:L164,\"WIN\",K$24:K164)-SUM(W$23:W163),\"\")","v":""},{"$f":"IF(AND(L164=\"LOSS\",L165<>\"LOSS\"),SUMIF(L$24:L164,\"LOSS\",K$24:K164)-SUM(X$23:X163),\"\")","v":""}]
[null,"Row 165 (142)",null,93,null,13760.764195594604,null,137.60764195594604,null,null,-137.60764195594604,"LOSS",{"$f":"IF(COUNTA($F$6:$F$10)=5,(F166-F24)/F24,\"\")","v":0.36231565536386567},4,"last",null,null,null,null,null,null,null,{"$f":"IF(AND(L165=\"WIN\",L166<>\"WIN\"),SUMIF(L$24:L165,\"WIN\",K$24:K165)-SUM(W$23:W164),\"\")","v":""},{"$f":"IF(AND(L165=\"LOSS\",L166<>\"LOSS\"),SUMIF(L$24:L165,\"LOSS\",K$24:K165)-SUM(X$23:X164),\"\")","v":-558.82672738564906}]
[null,"Row 166 (143)",null,46,null,13623.156553638657,null,136.23156553638657,null,null,163.47787864366387,"WIN",{"$f":"IF(COUNTA($F$6:$F$10)=5,(F167-F24)/F24,\"\")","v":0.37866344322823209},1,"new",null,null,null,null,null,null,null,{"$f":"IF(AND(L166=\"WIN\",L167<>\"WIN\"),SUMIF(L$24:L166,\"WIN\",K$24:K166)-SUM(W$23:W165),\"\")","v":""},{"$f":"IF(AND(L166=\"LOSS\",L167<>\"LOSS\"),SUMIF(L$24:L166,\"LOSS\",K$24:K166)-SUM(X$23:X165),\"\")","v":""}]
[null,"Row 167 (144)",null,9,null,13786.634432282321,null,137.86634432282321,null,null,165.43961318738783,"WIN",{"$f":"IF(COUNTA($F$6:$F$10)=5,(F168-F24)/F24,\"\")","v":0.39520740454697079},2,"middle",null,null,null,null,null,null,null,{"$f":"IF(AND(L167=\"WIN\",L168<>\"WIN\"),SUMIF(L$24:L167,\"WIN\",K$24:K167)-SUM(W$23:W166),\"\")","v":""},{"$f":"IF(AND(L167=\"LOSS\",L168<>\"LOSS\"),SUMIF(L$24:L167,\"LOSS\",K$24:K167)-SUM(X$23:X166),\"\")","v":""}]
[null,"Row 168 (145)",null,4,null,13952.074045469708,null,139.52074045469709,null,null,167.42488854563649,"WIN",{"$f":"IF(COUNTA($F$6:$F$10)=5,(F169-F24)/F24,\"\")","v":0.41194989340153443},3,"middle",null,null,null,null,null,null,null,{"$f":"IF(AND(L168=\"WIN\",L169<>\"WIN\"),SUMIF(L$24:L168,\"WIN\",K$24:K168)-SUM(W$23:W167),\"\")","v":""},{"$f":"IF(AND(L168=\"LOSS\",L169<>\"LOSS\"),SUMIF(L$24:L168,\"LOSS\",K$24:K168)-SUM(X$23:X167),\"\")","v":""}]
[null,"Row 169 (146)",null,32,null,14119.498934015344,null,141.19498934015346,null,null,169.43398720818413,"WIN",{"$f":"IF(COUNTA($F$6:$F$10)=5,(F170-F24)/F24,\"\")","v":0.42889329212235278},4,"last",null,null,null,null,null,null,null,{"$f":"IF(AND(L169=\"WIN\",L170<>\"WIN\"),SUMIF(L$24:L169,\"WIN\",K$24:K169)-SUM(W$23:W168),\"\")","v":665.77636758487097},{"$f":"IF(AND(L169=\"LOSS\",L170<>\"LOSS\"),SUMIF(L$24:L169,\"LOSS\",K$24:K169)-SUM(X$23:X168),\"\")","v":""}]
[null,"Row 170 (147)",null,84,null,14288.932921223528,null,142.88932921223528,null,null,-142.88932921223528,"LOSS",{"$f":"IF(COUNTA($F$6:$F$10)=5,(F171-F24)/F24,\"\")","v":0.4146043592011292},1,"new",null,null,null,null,null,null,null,{"$f":"IF(AND(L170=\"WIN\",L171<>\"WIN\"),SUMIF(L$24:L170,\"WIN\",K$24:K170)-SUM(W$23:W169),\"\")","v":""},{"$f":"IF(AND(L170=\"LOSS\",L171<>\"LOSS\"),SUMIF(L$24:L170,\"LOSS\",K$24:K170)-SUM(X$23:X169),\"\")","v":""}]
[null,"Row 171 (148)",null,100,null,14146.043592011292,null,141.46043592011293,null,null,-141.46043592011293,"LOSS",{"$f":"IF(COUNTA($F$6:$F$10)=5,(F172-F24)/F24,\"\")","v":0.40045831560911793},2,"middle",null,null,null,null,null,null,null,{"$f":"IF(AND(L171=\"WIN\",L172<>\"WIN\"),SUMIF(L$24:L171,\"WIN\",K$24:K171)-SUM(W$23:W170),\"\")","v":""},{"$f":"IF(AND(L171=\"LOSS\",L172<>\"LOSS\"),SUMIF(L$24:L171,\"LOSS\",K$24:K171)-SUM(X$23:X170),\"\")","v":""}]
[null,"Row 172 (149)",null,98,null,14004.583156091179,null,140.04583156091181,null,null,-140.04583156091181,"LOSS",{"$f":"IF(COUNTA($F$6:$F$10)=5,(F173-F24)/F24,\"\")","v":0.38645373245302672},3,"last",null,null,null,null,null,null,null,{"$f":"IF(AND(L172=\"WIN\",L173<>\"WIN\"),SUMIF(L$24:L172,\"WIN\",K$24:K172)-SUM(W$23:W171),\"\")","v":""},{"$f":"IF(AND(L172=\"LOSS\",L173<>\"LOSS\"),SUMIF(L$24:L172,\"LOSS\",K$24:K172)-SUM(X$23:X171),\"\")","v":-424.39559669326081}]
[null,"Row 173 (150)",null,3,null,13864.537324530267,null,138.64537324530266,null,null,166.37444789436319,"WIN",{"$f":"IF(COUNTA($F$6:$F$10)=5,(F174-F24)/F24,\"\")","v":0.40309117724246296},1,"last",null,null,null,null,null,null,null,{"$f":"IF(AND(L173=\"WIN\",L174<>\"WIN\"),SUMIF(L$24:L173,\"WIN\",K$24:K173)-SUM(W$23:W172),\"\")","v":166.37444789436267},{"$f":"IF(AND(L173=\"LOSS\",L174<>\"LOSS\"),SUMIF(L$24:L173,\"LOSS\",K$24:K173)-SUM(X$23:X172),\"\")","v":""}]
[null,"Row 174 (151)",null,82,null,14030.91177242463,null,140.30911772424631,null,null,-140.30911772424631,"LOSS",{"$f":"IF(COUNTA($F$6:$F$10)=5,(F175-F24)/F24,\"\")","v":0.38906026547003841},1,"last",null,null,null,null,null,null,null,{"$f":"IF(AND(L174=\"WIN\",L175<>\"WIN\"),SUMIF(L$24:L174,\"WIN\",K$24:K174)-SUM(W$23:W173),\"\")","v":""},{"$f":"IF(AND(L174=\"LOSS\",L175<>\"LOSS\"),SUMIF(L$24:L174,\"LOSS\",K$24:K174)-SUM(X$23:X173),\"\")","v":-140.30911772424588}]
[null,"Row 175 (152)",null,47,null,13890.602654700384,null,138.90602654700385,null,null,166.68723185640462,"WIN",{"$f":"IF(COUNTA($F$6:$F$10)=5,(F176-F24)/F24,\"\")","v":0.40572898865567897},1,"last",null,null,null,null,null,null,null,{"$f":"IF(AND(L175=\"WIN\",L176<>\"WIN\"),SUMIF(L$24:L175,\"WIN\",K$24:K175)-SUM(W$23:W174),\"\")","v":166.68723185640374},{"$f":"IF(AND(L175=\"LOSS\",L176<>\"LOSS\"),SUMIF(L$24:L175,\"LOSS\",K$24:K175)-SUM(X$23:X174),\"\")","v":""}]
[null,"Row 176 (153)",null,91,null,14057.289886556789,null,140.57289886556791,null,null,-140.57289886556791,"LOSS",{"$f":"IF(COUNTA($F$6:$F$10)=5,(F177-F24)/F24,\"\")","v":0.39167169876912211},1,"new",null,null,null,null,null,null,null,{"$f":"IF(AND(L176=\"WIN\",L177<>\"WIN\"),SUMIF(L$24:L176,\"WIN\",K$24:K176)-SUM(W$23:W175),\"\")","v":""},{"$f":"IF(AND(L176=\"LOSS\",L177<>\"LOSS\"),SUMIF(L$24:L176,\"LOSS\",K$24:K176)-SUM(X$23:X175),\"\")","v":""}]
[null,"Row 177 (154)",null,75,null,13916.716987691221,null,139.16716987691223,null,null,-139.16716987691223,"LOSS",{"$f":"IF(COUNTA($F$6:$F$10)=5,(F178-F24)/F24,\"\")","v":0.37775498178143097},2,"middle",null,null,null,null,null,null,null,{"$f":"IF(AND(L177=\"WIN\",L178<>\"WIN\"),SUMIF(L$24:L177,\"WIN\",K$24:K177)-SUM(W$23:W176),\"\")","v":""},{"$f":"IF(AND(L177=\"LOSS\",L178<>\"LOSS\"),SUMIF(L$24:L177,\"LOSS\",K$24:K177)-SUM(X$23:X176),\"\")","v":""}]
[null,"Row 178 (155)",null,99,null,13777.54981781431,null,137.7754981781431,null,null,-137.7754981781431,"LOSS",{"$f":"IF(COUNTA($F$6:$F$10)=5,(F179-F24)/F24,\"\")","v":0.36397743196361659},3,"middle",null,null,null,null,null,null,null,{"$f":"IF(AND(L178=\"WIN\",L179<>\"WIN\"),SUMIF(L$24:L178,\"WIN\",K$24:K178)-SUM(W$23:W177),\"\")","v":""},{"$f":"IF(AND(L178=\"LOSS\",L179<>\"LOSS\"),SUMIF(L$24:L178,\"LOSS\",K$24:K178)-SUM(X$23:X177),\"\")","v":""}]
[null,"Row 179 (156)",null,57,null,13639.774319636166,null,136.39774319636166,null,null,-136.39774319636166,"LOSS",{"$f":"IF(COUNTA($F$6:$F$10)=5,(F180-F24)/F24,\"\")","v":0.3503376576439805},4,"last",null,null,null,null,null,null,null,{"$f":"IF(AND(L179=\"WIN\",L180<>\"WIN\"),SUMIF(L$24:L179,\"WIN\",K$24:K179)-SUM(W$23:W178),\"\")","v":""},{"$f":"IF(AND(L179=\"LOSS\",L180<>\"LOSS\"),SUMIF(L$24:L179,\"LOSS\",K$24:K179)-SUM(X$23:X178),\"\")","v":-553.91331011698458}]
[null,"Row 180 (157)",null,34,null,13503.376576439805,null,135.03376576439805,null,null,162.04051891727767,"WIN",{"$f":"IF(COUNTA($F$6:$F$10)=5,(F181-F24)/F24,\"\")","v":0.3665417095357083},1,"new",null,null,null,null,null,null,null,{"$f":"IF(AND(L180=\"WIN\",L181<>\"WIN\"),SUMIF(L$24:L180,\"WIN\",K$24:K180)-SUM(W$23:W179),\"\")","v":""},{"$f":"IF(AND(L180=\"LOSS\",L181<>\"LOSS\"),SUMIF(L$24:L180,\"LOSS\",K$24:K180)-SUM(X$23:X179),\"\")","v":""}]
[null,"Row 181 (158)",null,14,null,13665.417095357083,null,136.65417095357083,null,null,163.985005144285,"WIN",{"$f":"IF(COUNTA($F$6:$F$10)=5,(F182-F24)/F24,\"\")","v":0.38294021005013673},2,"last",null,null,null,null,null,null,null,{"$f":"IF(AND(L181=\"WIN\",L182<>\"WIN\"),SUMIF(L$24:L181,\"WIN\",K$24:K181)-SUM(W$23:W180),\"\")","v":326.02552406156246},{"$f":"IF(AND(L181=\"LOSS\",L182<>\"LOSS\"),SUMIF(L$24:L181,\"LOSS\",K$24:K181)-SUM(X$23:X180),\"\")","v":""}]
[null,"Row 182 (159)",null,78,null,13829.402100501367,null,138.29402100501369,null,null,-138.29402100501369,"LOSS",{"$f":"IF(COUNTA($F$6:$F$10)=5,(F183-F24)/F24,\"\")","v":0.3691108079496353},1,"last",null,null,null,null,null,null,null,{"$f":"IF(AND(L182=\"WIN\",L183<>\"WIN\"),SUMIF(L$24:L182,\"WIN\",K$24:K182)-SUM(W$23:W181),\"\")","v":""},{"$f":"IF(AND(L182=\"LOSS\",L183<>\"LOSS\"),SUMIF(L$24:L182,\"LOSS\",K$24:K182)-SUM(X$23:X181),\"\")","v":-138.29402100501284}]
[null,"Row 183 (160)",null,20,null,13691.108079496353,null,136.91108079496354,null,null,164.29329695395623,"WIN",{"$f":"IF(COUNTA($F$6:$F$10)=5,(F184-F24)/F24,\"\")","v":0.38554013764503087},1,"new",null,null,null,null,null,null,null,{"$f":"IF(AND(L183=\"WIN\",L184<>\"WIN\"),SUMIF(L$24:L183,\"WIN\",K$24:K183)-SUM(W$23:W182),\"\")","v":""},{"$f":"IF(AND(L183=\"LOSS\",L184<>\"LOSS\"),SUMIF(L$24:L183,\"LOSS\",K$24:K183)-SUM(X$23:X182),\"\")","v":""}]
[null,"Row 184 (161)",null,9,null,13855.401376450309,null,138.55401376450308,null,null,166.26481651740369,"WIN",{"$f":"IF(COUNTA($F$6:$F$10)=5,(F185-F24)/F24,\"\")","v":0.40216661929677122},2,"middle",null,null,null,null,null,null,null,{"$f":"IF(AND(L184=\"WIN\",L185<>\"WIN\"),SUMIF(L$24:L184,\"WIN\",K$24:K184)-SUM(W$23:W183),\"\")","v":""},{"$f":"IF(AND(L184=\"LOSS\",L185<>\"LOSS\"),SUMIF(L$24:L184,\"LOSS\",K$24:K184)-SUM(X$23:X183),\"\")","v":""}]
[null,"Row 185 (162)",null,13,null,14021.666192967712,null,140.21666192967712,null,null,168.25999431561254,"WIN",{"$f":"IF(COUNTA($F$6:$F$10)=5,(F186-F24)/F24,\"\")","v":0.41899261872833249},3,"last",null,null,null,null,null,null,null,{"$f":"IF(AND(L185=\"WIN\",L186<>\"WIN\"),SUMIF(L$24:L185,\"WIN\",K$24:K185)-SUM(W$23:W184),\"\")","v":498.81810778697218},{"$f":"IF(AND(L185=\"LOSS\",L186<>\"LOSS\"),SUMIF(L$24:L185,\"LOSS\",K$24:K185)-SUM(X$23:X184),\"\")","v":""}]
[null,"Row 186 (163)",null,76,null,14189.926187283325,null,141.89926187283325,null,null,-141.89926187283325,"LOSS",{"$f":"IF(COUNTA($F$6:$F$10)=5,(F187-F24)/F24,\"\")","v":0.40480269254104917},1,"last",null,null,null,null,null,null,null,{"$f":"IF(AND(L186=\"WIN\",L187<>\"WIN\"),SUMIF(L$24:L186,\"WIN\",K$24:K186)-SUM(W$23:W185),\"\")","v":""},{"$f":"IF(AND(L186=\"LOSS\",L187<>\"LOSS\"),SUMIF(L$24:L186,\"LOSS\",K$24:K186)-SUM(X$23:X185),\"\")","v":-141.89926187283345}]
[null,"Row 187 (164)",null,31,null,14048.026925410491,null,140.48026925410491,null,null,168.57632310492588,"WIN",{"$f":"IF(COUNTA($F$6:$F$10)=5,(F188-F24)/F24,\"\")","v":0.42166032485154176},1,"new",null,null,null,null,null,null,null,{"$f":"IF(AND(L187=\"WIN\",L188<>\"WIN\"),SUMIF(L$24:L187,\"WIN\",K$24:K187)-SUM(W$23:W186),\"\")","v":""},{"$f":"IF(AND(L187=\"LOSS\",L188<>\"LOSS\"),SUMIF(L$24:L187,\"LOSS\",K$24:K187)-SUM(X$23:X186),\"\")","v":""}]
[null,"Row 188 (165)",null,54,null,14216.603248515417,null,142.16603248515418,null,null,170.599238982185,"WIN",{"$f":"IF(COUNTA($F$6:$F$10)=5,(F189-F24)/F24,\"\")","v":0.43872024874976034},2,"middle",null,null,null,null,null,null,null,{"$f":"IF(AND(L188=\"WIN\",L189<>\"WIN\"),SUMIF(L$24:L188,\"WIN\",K$24:K188)-SUM(W$23:W187),\"\")","v":""},{"$f":"IF(AND(L188=\"LOSS\",L189<>\"LOSS\"),SUMIF(L$24:L188,\"LOSS\",K$24:K188)-SUM(X$23:X187),\"\")","v":""}]
[null,"Row 189 (166)",null,48,null,14387.202487497603,null,143.87202487497603,null,null,172.64642984997124,"WIN",{"$f":"IF(COUNTA($F$6:$F$10)=5,(F190-F24)/F24,\"\")","v":0.45598489173475754},3,"last",null,null,null,null,null,null,null,{"$f":"IF(AND(L189=\"WIN\",L190<>\"WIN\"),SUMIF(L$24:L189,\"WIN\",K$24:K189)-SUM(W$23:W188),\"\")","v":511.8219919370822},{"$f":"IF(AND(L189=\"LOSS\",L190<>\"LOSS\"),SUMIF(L$24:L189,\"LOSS\",K$24:K189)-SUM(X$23:X188),\"\")","v":""}]
[null,"Row 190 (167)",null,96,null,14559.848917347575,null,145.59848917347577,null,null,-145.59848917347577,"LOSS",{"$f":"IF(COUNTA($F$6:$F$10)=5,(F191-F24)/F24,\"\")","v":0.44142504281741002},1,"last",null,null,null,null,null,null,null,{"$f":"IF(AND(L190=\"WIN\",L191<>\"WIN\"),SUMIF(L$24:L190,\"WIN\",K$24:K190)-SUM(W$23:W189),\"\")","v":""},{"$f":"IF(AND(L190=\"LOSS\",L191<>\"LOSS\"),SUMIF(L$24:L190,\"LOSS\",K$24:K190)-SUM(X$23:X189),\"\")","v":-145.59848917347517}]
[null,"Row 191 (168)",null,48,null,14414.2504281741,null,144.142504281741,null,null,172.9710051380892,"WIN",{"$f":"IF(COUNTA($F$6:$F$10)=5,(F192-F24)/F24,\"\")","v":0.45872214333121902},1,"last",null,null,null,null,null,null,null,{"$f":"IF(AND(L191=\"WIN\",L192<>\"WIN\"),SUMIF(L$24:L191,\"WIN\",K$24:K191)-SUM(W$23:W190),\"\")","v":172.97100513808982},{"$f":"IF(AND(L191=\"LOSS\",L192<>\"LOSS\"),SUMIF(L$24:L191,\"LOSS\",K$24:K191)-SUM(X$23:X190),\"\")","v":""}]
[null,"Row 192 (169)",null,74,null,14587.22143331219,null,145.87221433312192,null,null,-145.87221433312192,"LOSS",{"$f":"IF(COUNTA($F$6:$F$10)=5,(F193-F24)/F24,\"\")","v":0.44413492189790688},1,"new",null,null,null,null,null,null,null,{"$f":"IF(AND(L192=\"WIN\",L193<>\"WIN\"),SUMIF(L$24:L192,\"WIN\",K$24:K192)-SUM(W$23:W191),\"\")","v":""},{"$f":"IF(AND(L192=\"LOSS\",L193<>\"LOSS\"),SUMIF(L$24:L192,\"LOSS\",K$24:K192)-SUM(X$23:X191),\"\")","v":""}]
[null,"Row 193 (170)",null,57,null,14441.349218979069,null,144.4134921897907,null,null,-144.4134921897907,"LOSS",{"$f":"IF(COUNTA($F$6:$F$10)=5,(F194-F24)/F24,\"\")","v":0.42969357267892772},2,"middle",null,null,null,null,null,null,null,{"$f":"IF(AND(L193=\"WIN\",L194<>\"WIN\"),SUMIF(L$24:L193,\"WIN\",K$24:K193)-SUM(W$23:W192),\"\")","v":""},{"$f":"IF(AND(L193=\"LOSS\",L194<>\"LOSS\"),SUMIF(L$24:L193,\"LOSS\",K$24:K193)-SUM(X$23:X192),\"\")","v":""}]
[null,"Row 194 (171)",null,95,null,14296.935726789277,null,142.96935726789278,null,null,-142.96935726789278,"LOSS",{"$f":"IF(COUNTA($F$6:$F$10)=5,(F195-F24)/F24,\"\")","v":0.41539663695213841},3,"middle",null,null,null,null,null,null,null,{"$f":"IF(AND(L194=\"WIN\",L195<>\"WIN\"),SUMIF(L$24:L194,\"WIN\",K$24:K194)-SUM(W$23:W193),\"\")","v":""},{"$f":"IF(AND(L194=\"LOSS\",L195<>\"LOSS\"),SUMIF(L$24:L194,\"LOSS\",K$24:K194)-SUM(X$23:X193),\"\")","v":""}]
[null,"Row 195 (172)",null,92,null,14153.966369521384,null,141.53966369521385,null,null,-141.53966369521385,"LOSS",{"$f":"IF(COUNTA($F$6:$F$10)=5,(F196-F24)/F24,\"\")","v":0.40124267058261703},4,"middle",null,null,null,null,null,null,null,{"$f":"IF(AND(L195=\"WIN\",L196<>\"WIN\"),SUMIF(L$24:L195,\"WIN\",K$24:K195)-SUM(W$23:W194),\"\")","v":""},{"$f":"IF(AND(L195=\"LOSS\",L196<>\"LOSS\"),SUMIF(L$24:L195,\"LOSS\",K$24:K195)-SUM(X$23:X194),\"\")","v":""}]
[null,"Row 196 (173)",null,100,null,14012.42670582617,null,140.12426705826169,null,null,-140.12426705826169,"LOSS",{"$f":"IF(COUNTA($F$6:$F$10)=5,(F197-F24)/F24,\"\")","v":0.38723024387679089},5,"middle",null,null,null,null,null,null,null,{"$f":"IF(AND(L196=\"WIN\",L197<>\"WIN\"),SUMIF(L$24:L196,\"WIN\",K$24:K196)-SUM(W$23:W195),\"\")","v":""},{"$f":"IF(AND(L196=\"LOSS\",L197<>\"LOSS\"),SUMIF(L$24:L196,\"LOSS\",K$24:K196)-SUM(X$23:X195),\"\")","v":""}]
[null,"Row 197 (174)",null,84,null,13872.302438767909,null,138.72302438767909,null,null,-138.72302438767909,"LOSS",{"$f":"IF(COUNTA($F$6:$F$10)=5,(F198-F24)/F24,\"\")","v":0.37335794143802303},6,"middle",null,null,null,null,null,null,null,{"$f":"IF(AND(L197=\"WIN\",L198<>\"WIN\"),SUMIF(L$24:L197,\"WIN\",K$24:K197)-SUM(W$23:W196),\"\")","v":""},{"$f":"IF(AND(L197=\"LOSS\",L198<>\"LOSS\"),SUMIF(L$24:L197,\"LOSS\",K$24:K197)-SUM(X$23:X196),\"\")","v":""}]
[null,"Row 198 (175)",null,82,null,13733.57941438023,null,137.3357941438023,null,null,-137.3357941438023,"LOSS",{"$f":"IF(COUNTA($F$6:$F$10)=5,(F199-F24)/F24,\"\")","v":0.35962436202364279},7,"last",null,null,null,null,null,null,null,{"$f":"IF(AND(L198=\"WIN\",L199<>\"WIN\"),SUMIF(L$24:L198,\"WIN\",K$24:K198)-SUM(W$23:W197),\"\")","v":""},{"$f":"IF(AND(L198=\"LOSS\",L199<>\"LOSS\"),SUMIF(L$24:L198,\"LOSS\",K$24:K198)-SUM(X$23:X197),\"\")","v":-990.97781307576224}]
[null,"Row 199 (176)",null,44,null,13596.243620236428,null,135.96243620236427,null,null,163.15492344283712,"WIN",{"$f":"IF(COUNTA($F$6:$F$10)=5,(F200-F24)/F24,\"\")","v":0.37593985436792643},1,"last",null,null,null,null,null,null,null,{"$f":"IF(AND(L199=\"WIN\",L200<>\"WIN\"),SUMIF(L$24:L199,\"WIN\",K$24:K199)-SUM(W$23:W198),\"\")","v":163.15492344283666},{"$f":"IF(AND(L199=\"LOSS\",L200<>\"LOSS\"),SUMIF(L$24:L199,\"LOSS\",K$24:K199)-SUM(X$23:X198),\"\")","v":""}]
[null,"Row 200 (177)",null,99,null,13759.398543679265,null,137.59398543679265,null,null,-137.59398543679265,"LOSS",{"$f":"IF(COUNTA($F$6:$F$10)=5,(F201-F24)/F24,\"\")","v":0.36218045582424713},1,"new",null,null,null,null,null,null,null,{"$f":"IF(AND(L200=\"WIN\",L201<>\"WIN\"),SUMIF(L$24:L200,\"WIN\",K$24:K200)-SUM(W$23:W199),\"\")","v":""},{"$f":"IF(AND(L200=\"LOSS\",L201<>\"LOSS\"),SUMIF(L$24:L200,\"LOSS\",K$24:K200)-SUM(X$23:X199),\"\")","v":""}]
[null,"Row 201 (178)",null,80,null,13621.804558242471,null,136.21804558242471,null,null,-136.21804558242471,"LOSS",{"$f":"IF(COUNTA($F$6:$F$10)=5,(F202-F24)/F24,\"\")","v":0.34855865126600455},2,"middle",null,null,null,null,null,null,null,{"$f":"IF(AND(L201=\"WIN\",L202<>\"WIN\"),SUMIF(L$24:L201,\"WIN\",K$24:K201)-SUM(W$23:W200),\"\")","v":""},{"$f":"IF(AND(L201=\"LOSS\",L202<>\"LOSS\"),SUMIF(L$24:L201,\"LOSS\",K$24:K201)-SUM(X$23:X200),\"\")","v":""}]
[null,"Row 202 (179)",null,92,null,13485.586512660046,null,134.85586512660046,null,null,-134.85586512660046,"LOSS",{"$f":"IF(COUNTA($F$6:$F$10)=5,(F203-F24)/F24,\"\")","v":0.33507306475334442},3,"last",null,null,null,null,null,null,null,{"$f":"IF(AND(L202=\"WIN\",L203<>\"WIN\"),SUMIF(L$24:L202,\"WIN\",K$24:K202)-SUM(W$23:W201),\"\")","v":""},{"$f":"IF(AND(L202=\"LOSS\",L203<>\"LOSS\"),SUMIF(L$24:L202,\"LOSS\",K$24:K202)-SUM(X$23:X201),\"\")","v":-408.66789614582012}]
[null,"Row 203 (180)",null,18,null,13350.730647533444,null,133.50730647533445,null,null,160.20876777040132,"WIN",{"$f":"IF(COUNTA($F$6:$F$10)=5,(F204-F24)/F24,\"\")","v":0.35109394153038465},1,"new",null,null,null,null,null,null,null,{"$f":"IF(AND(L203=\"WIN\",L204<>\"WIN\"),SUMIF(L$24:L203,\"WIN\",K$24:K203)-SUM(W$23:W202),\"\")","v":""},{"$f":"IF(AND(L203=\"LOSS\",L204<>\"LOSS\"),SUMIF(L$24:L203,\"LOSS\",K$24:K203)-SUM(X$23:X202),\"\")","v":""}]
[null,"Row 204 (181)",null,7,null,13510.939415303847,null,135.10939415303847,null,null,162.13127298364614,"WIN",{"$f":"IF(COUNTA($F$6:$F$10)=5,(F205-F24)/F24,\"\")","v":0.36730706882874931},2,"last",null,null,null,null,null,null,null,{"$f":"IF(AND(L204=\"WIN\",L205<>\"WIN\"),SUMIF(L$24:L204,\"WIN\",K$24:K204)-SUM(W$23:W203),\"\")","v":322.34004075404846},{"$f":"IF(AND(L204=\"LOSS\",L205<>\"LOSS\"),SUMIF(L$24:L204,\"LOSS\",K$24:K204)-SUM(X$23:X203),\"\")","v":""}]
[null,"Row 205 (182)",null,73,null,13673.070688287493,null,136.73070688287493,null,null,-136.73070688287493,"LOSS",{"$f":"IF(COUNTA($F$6:$F$10)=5,(F206-F24)/F24,\"\")","v":0.3536339981404617},1,"new",null,null,null,null,null,null,null,{"$f":"IF(AND(L205=\"WIN\",L206<>\"WIN\"),SUMIF(L$24:L205,\"WIN\",K$24:K205)-SUM(W$23:W204),\"\")","v":""},{"$f":"IF(AND(L205=\"LOSS\",L206<>\"LOSS\"),SUMIF(L$24:L205,\"LOSS\",K$24:K205)-SUM(X$23:X204),\"\")","v":""}]
[null,"Row 206 (183)",null,74,null,13536.339981404617,null,135.36339981404618,null,null,-135.36339981404618,"LOSS",{"$f":"IF(COUNTA($F$6:$F$10)=5,(F207-F24)/F24,\"\")","v":0.34009765815905701},2,"middle",null,null,null,null,null,null,null,{"$f":"IF(AND(L206=\"WIN\",L207<>\"WIN\"),SUMIF(L$24:L206,\"WIN\",K$24:K206)-SUM(W$23:W205),\"\")","v":""},{"$f":"IF(AND(L206=\"LOSS\",L207<>\"LOSS\"),SUMIF(L$24:L206,\"LOSS\",K$24:K206)-SUM(X$23:X205),\"\")","v":""}]
[null,"Row 207 (184)",null,83,null,13400.97658159057,null,134.00976581590569,null,null,-134.00976581590569,"LOSS",{"$f":"IF(COUNTA($F$6:$F$10)=5,(F208-F24)/F24,\"\")","v":0.3266966815774664},3,"last",null,null,null,null,null,null,null,{"$f":"IF(AND(L207=\"WIN\",L208<>\"WIN\"),SUMIF(L$24:L207,\"WIN\",K$24:K207)-SUM(W$23:W206),\"\")","v":""},{"$f":"IF(AND(L207=\"LOSS\",L208<>\"LOSS\"),SUMIF(L$24:L207,\"LOSS\",K$24:K207)-SUM(X$23:X206),\"\")","v":-406.10387251282737}]
[null,"Row 208 (185)",null,23,null,13266.966815774664,null,132.66966815774663,null,null,159.20360178929596,"WIN",{"$f":"IF(COUNTA($F$6:$F$10)=5,(F209-F24)/F24,\"\")","v":0.34261704175639607},1,"last",null,null,null,null,null,null,null,{"$f":"IF(AND(L208=\"WIN\",L209<>\"WIN\"),SUMIF(L$24:L208,\"WIN\",K$24:K208)-SUM(W$23:W207),\"\")","v":159.20360178929513},{"$f":"IF(AND(L208=\"LOSS\",L209<>\"LOSS\"),SUMIF(L$24:L208,\"LOSS\",K$24:K208)-SUM(X$23:X207),\"\")","v":""}]
[null,"Row 209 (186)",null,61,null,13426.170417563961,null,134.26170417563961,null,null,-134.26170417563961,"LOSS",{"$f":"IF(COUNTA($F$6:$F$10)=5,(F210-F24)/F24,\"\")","v":0.32919087133883201},1,"last",null,null,null,null,null,null,null,{"$f":"IF(AND(L209=\"WIN\",L210<>\"WIN\"),SUMIF(L$24:L209,\"WIN\",K$24:K209)-SUM(W$23:W208),\"\")","v":""},{"$f":"IF(AND(L209=\"LOSS\",L210<>\"LOSS\"),SUMIF(L$24:L209,\"LOSS\",K$24:K209)-SUM(X$23:X208),\"\")","v":-134.26170417564026}]
[null,"Row 210 (187)",null,31,null,13291.90871338832,null,132.91908713388321,null,null,159.50290456065986,"WIN",{"$f":"IF(COUNTA($F$6:$F$10)=5,(F211-F24)/F24,\"\")","v":0.34514116179489812},1,"new",null,null,null,null,null,null,null,{"$f":"IF(AND(L210=\"WIN\",L211<>\"WIN\"),SUMIF(L$24:L210,\"WIN\",K$24:K210)-SUM(W$23:W209),\"\")","v":""},{"$f":"IF(AND(L210=\"LOSS\",L211<>\"LOSS\"),SUMIF(L$24:L210,\"LOSS\",K$24:K210)-SUM(X$23:X209),\"\")","v":""}]
[null,"Row 211 (188)",null,19,null,13451.411617948981,null,134.5141161794898,null,null,161.41693941538776,"WIN",{"$f":"IF(COUNTA($F$6:$F$10)=5,(F212-F24)/F24,\"\")","v":0.36128285573643698},2,"last",null,null,null,null,null,null,null,{"$f":"IF(AND(L211=\"WIN\",L212<>\"WIN\"),SUMIF(L$24:L211,\"WIN\",K$24:K211)-SUM(W$23:W210),\"\")","v":320.91984397604756},{"$f":"IF(AND(L211=\"LOSS\",L212<>\"LOSS\"),SUMIF(L$24:L211,\"LOSS\",K$24:K211)-SUM(X$23:X210),\"\")","v":""}]
[null,"Row 212 (189)",null,78,null,13612.82855736437,null,136.12828557364369,null,null,-136.12828557364369,"LOSS",{"$f":"IF(COUNTA($F$6:$F$10)=5,(F213-F24)/F24,\"\")","v":0.34767002717907253},1,"new",null,null,null,null,null,null,null,{"$f":"IF(AND(L212=\"WIN\",L213<>\"WIN\"),SUMIF(L$24:L212,\"WIN\",K$24:K212)-SUM(W$23:W211),\"\")","v":""},{"$f":"IF(AND(L212=\"LOSS\",L213<>\"LOSS\"),SUMIF(L$24:L212,\"LOSS\",K$24:K212)-SUM(X$23:X211),\"\")","v":""}]
[null,"Row 213 (190)",null,59,null,13476.700271790725,null,134.76700271790725,null,null,-134.76700271790725,"LOSS",{"$f":"IF(COUNTA($F$6:$F$10)=5,(F214-F24)/F24,\"\")","v":0.33419332690728187},2,"last",null,null,null,null,null,null,null,{"$f":"IF(AND(L213=\"WIN\",L214<>\"WIN\"),SUMIF(L$24:L213,\"WIN\",K$24:K213)-SUM(W$23:W212),\"\")","v":""},{"$f":"IF(AND(L213=\"LOSS\",L214<>\"LOSS\"),SUMIF(L$24:L213,\"LOSS\",K$24:K213)-SUM(X$23:X212),\"\")","v":-270.89528829155097}]
[null,"Row 214 (191)",null,24,null,13341.933269072819,null,133.4193326907282,null,null,160.10319922887382,"WIN",{"$f":"IF(COUNTA($F$6:$F$10)=5,(F215-F24)/F24,\"\")","v":0.35020364683016925},1,"new",null,null,null,null,null,null,null,{"$f":"IF(AND(L214=\"WIN\",L215<>\"WIN\"),SUMIF(L$24:L214,\"WIN\",K$24:K214)-SUM(W$23:W213),\"\")","v":""},{"$f":"IF(AND(L214=\"LOSS\",L215<>\"LOSS\"),SUMIF(L$24:L214,\"LOSS\",K$24:K214)-SUM(X$23:X213),\"\")","v":""}]
[null,"Row 215 (192)",null,14,null,13502.036468301692,null,135.02036468301694,null,null,162.02443761962033,"WIN",{"$f":"IF(COUNTA($F$6:$F$10)=5,(F216-F24)/F24,\"\")","v":0.36640609059213131},2,"last",null,null,null,null,null,null,null,{"$f":"IF(AND(L215=\"WIN\",L216<>\"WIN\"),SUMIF(L$24:L215,\"WIN\",K$24:K215)-SUM(W$23:W214),\"\")","v":322.12763684849415},{"$f":"IF(AND(L215=\"LOSS\",L216<>\"LOSS\"),SUMIF(L$24:L215,\"LOSS\",K$24:K215)-SUM(X$23:X214),\"\")","v":""}]
[null,"Row 216 (193)",null,57,null,13664.060905921313,null,136.64060905921312,null,null,-136.64060905921312,"LOSS",{"$f":"IF(COUNTA($F$6:$F$10)=5,(F217-F24)/F24,\"\")","v":0.35274202968620993},1,"new",null,null,null,null,null,null,null,{"$f":"IF(AND(L216=\"WIN\",L217<>\"WIN\"),SUMIF(L$24:L216,\"WIN\",K$24:K216)-SUM(W$23:W215),\"\")","v":""},{"$f":"IF(AND(L216=\"LOSS\",L217<>\"LOSS\"),SUMIF(L$24:L216,\"LOSS\",K$24:K216)-SUM(X$23:X215),\"\")","v":""}]
[null,"Row 217 (194)",null,68,null,13527.420296862099,null,{"$f":"IF(COUNTBLANK($F$6:$F$10),\"\",F217*$F$7)","v":135.27420296862098},null,null,-135.27420296862098,{"$f":"IF(D217=\"\",\"\",IF(D217<$F$8,\"WIN\",\"LOSS\"))","v":"LOSS"},{"$f":"IF(COUNTA($F$6:$F$10)=5,(F218-F24)/F24,\"\")","v":0.33921460938934778},{"$f":"IF(L217=L216,N216+1,1)","v":2},{"$f":"IF(N217=1,IF(N218=1,\"last\",\"new\"),IF(N218=1,\"last\",\"middle\"))","v":"last"},null,null,null,null,null,null,null,{"$f":"IF(AND(L217=\"WIN\",L218<>\"WIN\"),SUMIF(L$24:L217,\"WIN\",K$24:K217)-SUM(W$23:W216),\"\")","v":""},{"$f":"IF(AND(L217=\"LOSS\",L218<>\"LOSS\"),SUMIF(L$24:L217,\"LOSS\",K$24:K217)-SUM(X$23:X216),\"\")","v":-271.91481202783507}]
[null,"Row 218 (195)",null,2,null,{"$f":"IF(COUNTBLANK($F$6:$F$10),\"\",IF(D217<$F$8,(1+$F$7*$F$9)*F217-$F$10,(1-$F$7)*F217-$F$10))","v":13392.146093893478},null,133.92146093893479,null,null,{"$f":"IF(COUNTBLANK($F$6:$F$10),\"\", IF(L218=\"win\", H218*$F$9-$F$10, IF(L218=\"loss\", -H218-$F$10)))","v":160.70575312672173},"WIN",{"$f":"IF(COUNTA($F$6:$F$10)=5,(F219-F24)/F24,\"\")","v":0.35528518470201997},1,"new",null,null,null,null,null,null,null,{"$f":"IF(AND(L218=\"WIN\",L219<>\"WIN\"),SUMIF(L$24:L218,\"WIN\",K$24:K218)-SUM(W$23:W217),\"\")","v":""},{"$f":"IF(AND(L218=\"LOSS\",L219<>\"LOSS\"),SUMIF(L$24:L218,\"LOSS\",K$24:K218)-SUM(X$23:X217),\"\")","v":""}]
[null,"Row 219 (196)",null,22,null,13552.8518470202,null,135.52851847020199,null,null,162.63422216424237,"WIN",{"$f":"IF(COUNTA($F$6:$F$10)=5,(F220-F24)/F24,\"\")","v":0.37154860691844421},2,"last",null,null,null,null,null,null,null,{"$f":"IF(AND(L219=\"WIN\",L220<>\"WIN\"),SUMIF(L$24:L219,\"WIN\",K$24:K219)-SUM(W$23:W218),\"\")","v":323.3399752909645},{"$f":"IF(AND(L219=\"LOSS\",L220<>\"LOSS\"),SUMIF(L$24:L219,\"LOSS\",K$24:K219)-SUM(X$23:X218),\"\")","v":""}]
[null,"Row 220 (197)",null,69,null,13715.486069184442,null,137.15486069184442,null,null,-137.15486069184442,"LOSS",{"$f":"IF(COUNTA($F$6:$F$10)=5,(F221-F24)/F24,\"\")","v":0.35783312084925983},1,"last",null,null,null,null,null,null,null,{"$f":"IF(AND(L220=\"WIN\",L221<>\"WIN\"),SUMIF(L$24:L220,\"WIN\",K$24:K220)-SUM(W$23:W219),\"\")","v":""},{"$f":"IF(AND(L220=\"LOSS\",L221<>\"LOSS\"),SUMIF(L$24:L220,\"LOSS\",K$24:K220)-SUM(X$23:X219),\"\")","v":-137.15486069184408}]
[null,"Row 221 (198)",null,35,null,13578.331208492598,null,135.783312084926,null,null,162.93997450191119,"WIN",{"$f":"IF(COUNTA($F$6:$F$10)=5,(F222-F24)/F24,\"\")","v":0.37412711829945094},1,"last",null,null,null,null,null,null,null,{"$f":"IF(AND(L221=\"WIN\",L222<>\"WIN\"),SUMIF(L$24:L221,\"WIN\",K$24:K221)-SUM(W$23:W220),\"\")","v":162.93997450191091},{"$f":"IF(AND(L221=\"LOSS\",L222<>\"LOSS\"),SUMIF(L$24:L221,\"LOSS\",K$24:K221)-SUM(X$23:X220),\"\")","v":""}]
[null,"Row 222 (199)",null,68,null,13741.271182994509,null,137.4127118299451,null,null,-137.4127118299451,"LOSS",{"$f":"IF(COUNTA($F$6:$F$10)=5,(F223-F24)/F24,\"\")","v":0.36038584711645633},1,"new",null,null,null,null,null,null,null,{"$f":"IF(AND(L222=\"WIN\",L223<>\"WIN\"),SUMIF(L$24:L222,\"WIN\",K$24:K222)-SUM(W$23:W221),\"\")","v":""},{"$f":"IF(AND(L222=\"LOSS\",L223<>\"LOSS\"),SUMIF(L$24:L222,\"LOSS\",K$24:K222)-SUM(X$23:X221),\"\")","v":""}]
[null,"Row 223 (200)",null,72,null,13603.858471164564,null,136.03858471164563,null,null,-136.03858471164563,"LOSS",{"$f":"IF(COUNTA($F$6:$F$10)=5,(F224-F24)/F24,\"\")","v":0.34678198864529186},2,"middle",null,null,null,null,null,null,null,{"$f":"IF(AND(L223=\"WIN\",L224<>\"WIN\"),SUMIF(L$24:L223,\"WIN\",K$24:K223)-SUM(W$23:W222),\"\")","v":""},{"$f":"IF(AND(L223=\"LOSS\",L224<>\"LOSS\"),SUMIF(L$24:L223,\"LOSS\",K$24:K223)-SUM(X$23:X222),\"\")","v":""}]
[null,"Row 224 (201)",null,80,null,13467.819886452919,null,134.67819886452918,null,null,-134.67819886452918,"LOSS",{"$f":"IF(COUNTA($F$6:$F$10)=5,(F225-F24)/F24,\"\")","v":0.33331416875883896},3,"middle",null,null,null,null,null,null,null,{"$f":"IF(AND(L224=\"WIN\",L225<>\"WIN\"),SUMIF(L$24:L224,\"WIN\",K$24:K224)-SUM(W$23:W223),\"\")","v":""},{"$f":"IF(AND(L224=\"LOSS\",L225<>\"LOSS\"),SUMIF(L$24:L224,\"LOSS\",K$24:K224)-SUM(X$23:X223),\"\")","v":""}]
[null,"Row 225 (202)",null,67,null,13333.14168758839,null,133.33141687588389,null,null,-133.33141687588389,"LOSS",{"$f":"IF(COUNTA($F$6:$F$10)=5,(F226-F24)/F24,\"\")","v":0.31998102707125053},4,"middle",null,null,null,null,null,null,null,{"$f":"IF(AND(L225=\"WIN\",L226<>\"WIN\"),SUMIF(L$24:L225,\"WIN\",K$24:K225)-SUM(W$23:W224),\"\")","v":""},{"$f":"IF(AND(L225=\"LOSS\",L226<>\"LOSS\"),SUMIF(L$24:L225,\"LOSS\",K$24:K225)-SUM(X$23:X224),\"\")","v":""}]
[null,"Row 226 (203)",null,86,null,13199.810270712505,null,131.99810270712504,null,null,-131.99810270712504,"LOSS",{"$f":"IF(COUNTA($F$6:$F$10)=5,(F227-F24)/F24,\"\")","v":0.3067812168005381},5,"last",null,null,null,null,null,null,null,{"$f":"IF(AND(L226=\"WIN\",L227<>\"WIN\"),SUMIF(L$24:L226,\"WIN\",K$24:K226)-SUM(W$23:W225),\"\")","v":""},{"$f":"IF(AND(L226=\"LOSS\",L227<>\"LOSS\"),SUMIF(L$24:L226,\"LOSS\",K$24:K226)-SUM(X$23:X225),\"\")","v":-673.45901498912826}]
[null,"Row 227 (204)",null,3,null,13067.812168005381,null,130.67812168005381,null,null,156.81374601606456,"WIN",{"$f":"IF(COUNTA($F$6:$F$10)=5,(F228-F24)/F24,\"\")","v":0.32246259140214462},1,"new",null,null,null,null,null,null,null,{"$f":"IF(AND(L227=\"WIN\",L228<>\"WIN\"),SUMIF(L$24:L227,\"WIN\",K$24:K227)-SUM(W$23:W226),\"\")","v":""},{"$f":"IF(AND(L227=\"LOSS\",L228<>\"LOSS\"),SUMIF(L$24:L227,\"LOSS\",K$24:K227)-SUM(X$23:X226),\"\")","v":""}]
[null,"Row 228 (205)",null,40,null,13224.625914021446,null,132.24625914021448,null,null,158.69551096825737,"WIN",{"$f":"IF(COUNTA($F$6:$F$10)=5,(F229-F24)/F24,\"\")","v":0.33833214249897026},2,"last",null,null,null,null,null,null,null,{"$f":"IF(AND(L228=\"WIN\",L229<>\"WIN\"),SUMIF(L$24:L228,\"WIN\",K$24:K228)-SUM(W$23:W227),\"\")","v":315.50925698432184},{"$f":"IF(AND(L228=\"LOSS\",L229<>\"LOSS\"),SUMIF(L$24:L228,\"LOSS\",K$24:K228)-SUM(X$23:X227),\"\")","v":""}]
[null,"Row 229 (206)",null,96,null,13383.321424989703,null,133.83321424989703,null,null,-133.83321424989703,"LOSS",{"$f":"IF(COUNTA($F$6:$F$10)=5,(F230-F24)/F24,\"\")","v":0.3249488210739806},1,"last",null,null,null,null,null,null,null,{"$f":"IF(AND(L229=\"WIN\",L230<>\"WIN\"),SUMIF(L$24:L229,\"WIN\",K$24:K229)-SUM(W$23:W228),\"\")","v":""},{"$f":"IF(AND(L229=\"LOSS\",L230<>\"LOSS\"),SUMIF(L$24:L229,\"LOSS\",K$24:K229)-SUM(X$23:X228),\"\")","v":-133.83321424989663}]
[null,"Row 230 (207)",null,36,null,13249.488210739806,null,132.49488210739807,null,null,158.99385852887767,"WIN",{"$f":"IF(COUNTA($F$6:$F$10)=5,(F231-F24)/F24,\"\")","v":0.34084820692686846},1,"new",null,null,null,null,null,null,null,{"$f":"IF(AND(L230=\"WIN\",L231<>\"WIN\"),SUMIF(L$24:L230,\"WIN\",K$24:K230)-SUM(W$23:W229),\"\")","v":""},{"$f":"IF(AND(L230=\"LOSS\",L231<>\"LOSS\"),SUMIF(L$24:L230,\"LOSS\",K$24:K230)-SUM(X$23:X229),\"\")","v":""}]
[null,"Row 231 (208)",null,14,null,13408.482069268684,null,134.08482069268683,null,null,160.90178483122421,"WIN",{"$f":"IF(COUNTA($F$6:$F$10)=5,(F232-F24)/F24,\"\")","v":0.35693838540999095},2,"last",null,null,null,null,null,null,null,{"$f":"IF(AND(L231=\"WIN\",L232<>\"WIN\"),SUMIF(L$24:L231,\"WIN\",K$24:K231)-SUM(W$23:W230),\"\")","v":319.89564336010153},{"$f":"IF(AND(L231=\"LOSS\",L232<>\"LOSS\"),SUMIF(L$24:L231,\"LOSS\",K$24:K231)-SUM(X$23:X230),\"\")","v":""}]
[null,"Row 232 (209)",null,57,null,13569.38385409991,null,135.69383854099911,null,null,-135.69383854099911,"LOSS",{"$f":"IF(COUNTA($F$6:$F$10)=5,(F233-F24)/F24,\"\")","v":0.34336900155589101},1,"last",null,null,null,null,null,null,null,{"$f":"IF(AND(L232=\"WIN\",L233<>\"WIN\"),SUMIF(L$24:L232,\"WIN\",K$24:K232)-SUM(W$23:W231),\"\")","v":""},{"$f":"IF(AND(L232=\"LOSS\",L233<>\"LOSS\"),SUMIF(L$24:L232,\"LOSS\",K$24:K232)-SUM(X$23:X231),\"\")","v":-135.69383854099942}]
[null,"Row 233 (210)",null,39,null,13433.69001555891,null,134.33690015558909,null,null,161.20428018670691,"WIN",{"$f":"IF(COUNTA($F$6:$F$10)=5,(F234-F24)/F24,\"\")","v":0.35948942957456165},1,"new",null,null,null,null,null,null,null,{"$f":"IF(AND(L233=\"WIN\",L234<>\"WIN\"),SUMIF(L$24:L233,\"WIN\",K$24:K233)-SUM(W$23:W232),\"\")","v":""},{"$f":"IF(AND(L233=\"LOSS\",L234<>\"LOSS\"),SUMIF(L$24:L233,\"LOSS\",K$24:K233)-SUM(X$23:X232),\"\")","v":""}]
[null,"Row 234 (211)",null,8,null,13594.894295745617,null,135.94894295745615,null,null,163.13873154894739,"WIN",{"$f":"IF(COUNTA($F$6:$F$10)=5,(F235-F24)/F24,\"\")","v":0.3758033027294565},2,"last",null,null,null,null,null,null,null,{"$f":"IF(AND(L234=\"WIN\",L235<>\"WIN\"),SUMIF(L$24:L234,\"WIN\",K$24:K234)-SUM(W$23:W233),\"\")","v":324.34301173565473},{"$f":"IF(AND(L234=\"LOSS\",L235<>\"LOSS\"),SUMIF(L$24:L234,\"LOSS\",K$24:K234)-SUM(X$23:X233),\"\")","v":""}]
[null,"Row 235 (212)",null,89,null,13758.033027294565,null,137.58033027294564,null,null,-137.58033027294564,"LOSS",{"$f":"IF(COUNTA($F$6:$F$10)=5,(F236-F24)/F24,\"\")","v":0.36204526970216194},1,"new",null,null,null,null,null,null,null,{"$f":"IF(AND(L235=\"WIN\",L236<>\"WIN\"),SUMIF(L$24:L235,\"WIN\",K$24:K235)-SUM(W$23:W234),\"\")","v":""},{"$f":"IF(AND(L235=\"LOSS\",L236<>\"LOSS\"),SUMIF(L$24:L235,\"LOSS\",K$24:K235)-SUM(X$23:X234),\"\")","v":""}]
[null,"Row 236 (213)",null,99,null,13620.452697021619,null,136.20452697021619,null,null,-136.20452697021619,"LOSS",{"$f":"IF(COUNTA($F$6:$F$10)=5,(F237-F24)/F24,\"\")","v":0.34842481700514033},2,"middle",null,null,null,null,null,null,null,{"$f":"IF(AND(L236=\"WIN\",L237<>\"WIN\"),SUMIF(L$24:L236,\"WIN\",K$24:K236)-SUM(W$23:W235),\"\")","v":""},{"$f":"IF(AND(L236=\"LOSS\",L237<>\"LOSS\"),SUMIF(L$24:L236,\"LOSS\",K$24:K236)-SUM(X$23:X235),\"\")","v":""}]
[null,"Row 237 (214)",null,100,null,13484.248170051404,null,134.84248170051404,null,null,-134.84248170051404,"LOSS",{"$f":"IF(COUNTA($F$6:$F$10)=5,(F238-F24)/F24,\"\")","v":0.33494056883508894},3,"middle",null,null,null,null,null,null,null,{"$f":"IF(AND(L237=\"WIN\",L238<>\"WIN\"),SUMIF(L$24:L237,\"WIN\",K$24:K237)-SUM(W$23:W236),\"\")","v":""},{"$f":"IF(AND(L237=\"LOSS\",L238<>\"LOSS\"),SUMIF(L$24:L237,\"LOSS\",K$24:K237)-SUM(X$23:X236),\"\")","v":""}]
[null,"Row 238 (215)",null,57,null,13349.405688350889,null,133.4940568835089,null,null,-133.4940568835089,"LOSS",{"$f":"IF(COUNTA($F$6:$F$10)=5,(F239-F24)/F24,\"\")","v":0.32159116314673813},4,"last",null,null,null,null,null,null,null,{"$f":"IF(AND(L238=\"WIN\",L239<>\"WIN\"),SUMIF(L$24:L238,\"WIN\",K$24:K238)-SUM(W$23:W237),\"\")","v":""},{"$f":"IF(AND(L238=\"LOSS\",L239<>\"LOSS\"),SUMIF(L$24:L238,\"LOSS\",K$24:K238)-SUM(X$23:X237),\"\")","v":-542.12139582718373}]
[null,"Row 239 (216)",null,23,null,13215.911631467381,null,132.15911631467381,null,null,158.59093957760857,"WIN",{"$f":"IF(COUNTA($F$6:$F$10)=5,(F240-F24)/F24,\"\")","v":0.337450257104499},1,"last",null,null,null,null,null,null,null,{"$f":"IF(AND(L239=\"WIN\",L240<>\"WIN\"),SUMIF(L$24:L239,\"WIN\",K$24:K239)-SUM(W$23:W238),\"\")","v":158.59093957760706},{"$f":"IF(AND(L239=\"LOSS\",L240<>\"LOSS\"),SUMIF(L$24:L239,\"LOSS\",K$24:K239)-SUM(X$23:X238),\"\")","v":""}]
[null,"Row 240 (217)",null,81,null,13374.50257104499,null,133.74502571044991,null,null,-133.74502571044991,"LOSS",{"$f":"IF(COUNTA($F$6:$F$10)=5,(F241-F24)/F24,\"\")","v":0.324075754533454},1,"new",null,null,null,null,null,null,null,{"$f":"IF(AND(L240=\"WIN\",L241<>\"WIN\"),SUMIF(L$24:L240,\"WIN\",K$24:K240)-SUM(W$23:W239),\"\")","v":""},{"$f":"IF(AND(L240=\"LOSS\",L241<>\"LOSS\"),SUMIF(L$24:L240,\"LOSS\",K$24:K240)-SUM(X$23:X239),\"\")","v":""}]
[null,"Row 241 (218)",null,83,null,13240.75754533454,null,132.4075754533454,null,null,-132.4075754533454,"LOSS",{"$f":"IF(COUNTA($F$6:$F$10)=5,(F242-F24)/F24,\"\")","v":0.31083499698811939},2,"middle",null,null,null,null,null,null,null,{"$f":"IF(AND(L241=\"WIN\",L242<>\"WIN\"),SUMIF(L$24:L241,\"WIN\",K$24:K241)-SUM(W$23:W240),\"\")","v":""},{"$f":"IF(AND(L241=\"LOSS\",L242<>\"LOSS\"),SUMIF(L$24:L241,\"LOSS\",K$24:K241)-SUM(X$23:X240),\"\")","v":""}]
[null,"Row 242 (219)",null,91,null,13108.349969881194,null,131.08349969881195,null,null,-131.08349969881195,"LOSS",{"$f":"IF(COUNTA($F$6:$F$10)=5,(F243-F24)/F24,\"\")","v":0.29772664701823814},3,"middle",null,null,null,null,null,null,null,{"$f":"IF(AND(L242=\"WIN\",L243<>\"WIN\"),SUMIF(L$24:L242,\"WIN\",K$24:K242)-SUM(W$23:W241),\"\")","v":""},{"$f":"IF(AND(L242=\"LOSS\",L243<>\"LOSS\"),SUMIF(L$24:L242,\"LOSS\",K$24:K242)-SUM(X$23:X241),\"\")","v":""}]
[null,"Row 243 (220)",null,59,null,12977.266470182381,null,129.77266470182383,null,null,-129.77266470182383,"LOSS",{"$f":"IF(COUNTA($F$6:$F$10)=5,(F244-F24)/F24,\"\")","v":0.28474938054805571},4,"middle",null,null,null,null,null,null,null,{"$f":"IF(AND(L243=\"WIN\",L244<>\"WIN\"),SUMIF(L$24:L243,\"WIN\",K$24:K243)-SUM(W$23:W242),\"\")","v":""},{"$f":"IF(AND(L243=\"LOSS\",L244<>\"LOSS\"),SUMIF(L$24:L243,\"LOSS\",K$24:K243)-SUM(X$23:X242),\"\")","v":""}]
[null,"Row 244 (221)",null,64,null,12847.493805480557,null,128.47493805480556,null,null,-128.47493805480556,"LOSS",{"$f":"IF(COUNTA($F$6:$F$10)=5,(F245-F24)/F24,\"\")","v":0.27190188674257515},5,"last",null,null,null,null,null,null,null,{"$f":"IF(AND(L244=\"WIN\",L245<>\"WIN\"),SUMIF(L$24:L244,\"WIN\",K$24:K244)-SUM(W$23:W243),\"\")","v":""},{"$f":"IF(AND(L244=\"LOSS\",L245<>\"LOSS\"),SUMIF(L$24:L244,\"LOSS\",K$24:K244)-SUM(X$23:X243),\"\")","v":-655.48370361923844}]
[null,"Row 245 (222)",null,8,null,12719.018867425752,null,127.19018867425751,null,null,152.628226409109,"WIN",{"$f":"IF(COUNTA($F$6:$F$10)=5,(F246-F24)/F24,\"\")","v":0.28716470938348609},1,"last",null,null,null,null,null,null,null,{"$f":"IF(AND(L245=\"WIN\",L246<>\"WIN\"),SUMIF(L$24:L245,\"WIN\",K$24:K245)-SUM(W$23:W244),\"\")","v":152.62822640910963},{"$f":"IF(AND(L245=\"LOSS\",L246<>\"LOSS\"),SUMIF(L$24:L245,\"LOSS\",K$24:K245)-SUM(X$23:X244),\"\")","v":""}]
[null,"Row 246 (223)",null,98,null,12871.647093834861,null,128.71647093834861,null,null,-128.71647093834861,"LOSS",{"$f":"IF(COUNTA($F$6:$F$10)=5,(F247-F24)/F24,\"\")","v":0.27429306228965122},1,"last",null,null,null,null,null,null,null,{"$f":"IF(AND(L246=\"WIN\",L247<>\"WIN\"),SUMIF(L$24:L246,\"WIN\",K$24:K246)-SUM(W$23:W245),\"\")","v":""},{"$f":"IF(AND(L246=\"LOSS\",L247<>\"LOSS\"),SUMIF(L$24:L246,\"LOSS\",K$24:K246)-SUM(X$23:X245),\"\")","v":-128.71647093834872}]
[null,"Row 247 (224)",null,21,null,12742.930622896512,null,127.42930622896513,null,null,152.91516747475816,"WIN",{"$f":"IF(COUNTA($F$6:$F$10)=5,(F248-F24)/F24,\"\")","v":0.28958457903712714},1,"last",null,null,null,null,null,null,null,{"$f":"IF(AND(L247=\"WIN\",L248<>\"WIN\"),SUMIF(L$24:L247,\"WIN\",K$24:K247)-SUM(W$23:W246),\"\")","v":152.91516747475907},{"$f":"IF(AND(L247=\"LOSS\",L248<>\"LOSS\"),SUMIF(L$24:L247,\"LOSS\",K$24:K247)-SUM(X$23:X246),\"\")","v":""}]
[null,"Row 248 (225)",null,96,null,12895.845790371272,null,128.95845790371271,null,null,-128.95845790371271,"LOSS",{"$f":"IF(COUNTA($F$6:$F$10)=5,(F249-F24)/F24,\"\")","v":0.27668873324675586},1,"last",null,null,null,null,null,null,null,{"$f":"IF(AND(L248=\"WIN\",L249<>\"WIN\"),SUMIF(L$24:L248,\"WIN\",K$24:K248)-SUM(W$23:W247),\"\")","v":""},{"$f":"IF(AND(L248=\"LOSS\",L249<>\"LOSS\"),SUMIF(L$24:L248,\"LOSS\",K$24:K248)-SUM(X$23:X247),\"\")","v":-128.95845790371277}]
[null,"Row 249 (226)",null,11,null,12766.887332467559,null,127.66887332467559,null,null,153.20264798961071,"WIN",{"$f":"IF(COUNTA($F$6:$F$10)=5,(F250-F24)/F24,\"\")","v":0.29200899804571689},1,"new",null,null,null,null,null,null,null,{"$f":"IF(AND(L249=\"WIN\",L250<>\"WIN\"),SUMIF(L$24:L249,\"WIN\",K$24:K249)-SUM(W$23:W248),\"\")","v":""},{"$f":"IF(AND(L249=\"LOSS\",L250<>\"LOSS\"),SUMIF(L$24:L249,\"LOSS\",K$24:K249)-SUM(X$23:X248),\"\")","v":""}]
[null,"Row 250 (227)",null,32,null,12920.089980457169,null,129.20089980457169,null,null,155.04107976548602,"WIN",{"$f":"IF(COUNTA($F$6:$F$10)=5,(F251-F24)/F24,\"\")","v":0.3075131060222655},2,"middle",null,null,null,null,null,null,null,{"$f":"IF(AND(L250=\"WIN\",L251<>\"WIN\"),SUMIF(L$24:L250,\"WIN\",K$24:K250)-SUM(W$23:W249),\"\")","v":""},{"$f":"IF(AND(L250=\"LOSS\",L251<>\"LOSS\"),SUMIF(L$24:L250,\"LOSS\",K$24:K250)-SUM(X$23:X249),\"\")","v":""}]
[null,"Row 251 (228)",null,16,null,13075.131060222655,null,130.75131060222654,null,null,156.90157272267183,"WIN",{"$f":"IF(COUNTA($F$6:$F$10)=5,(F252-F24)/F24,\"\")","v":0.32320326329453275},3,"middle",null,null,null,null,null,null,null,{"$f":"IF(AND(L251=\"WIN\",L252<>\"WIN\"),SUMIF(L$24:L251,\"WIN\",K$24:K251)-SUM(W$23:W250),\"\")","v":""},{"$f":"IF(AND(L251=\"LOSS\",L252<>\"LOSS\"),SUMIF(L$24:L251,\"LOSS\",K$24:K251)-SUM(X$23:X250),\"\")","v":""}]
[null,"Row 252 (229)",null,26,null,13232.032632945327,null,132.32032632945328,null,null,158.78439159534392,"WIN",{"$f":"IF(COUNTA($F$6:$F$10)=5,(F253-F24)/F24,\"\")","v":0.3390817024540671},4,"last",null,null,null,null,null,null,null,{"$f":"IF(AND(L252=\"WIN\",L253<>\"WIN\"),SUMIF(L$24:L252,\"WIN\",K$24:K252)-SUM(W$23:W251),\"\")","v":623.92969207311762},{"$f":"IF(AND(L252=\"LOSS\",L253<>\"LOSS\"),SUMIF(L$24:L252,\"LOSS\",K$24:K252)-SUM(X$23:X251),\"\")","v":""}]
[null,"Row 253 (230)",null,79,null,13390.817024540671,null,133.90817024540672,null,null,-133.90817024540672,"LOSS",{"$f":"IF(COUNTA($F$6:$F$10)=5,(F254-F24)/F24,\"\")","v":0.32569088542952651},1,"new",null,null,null,null,null,null,null,{"$f":"IF(AND(L253=\"WIN\",L254<>\"WIN\"),SUMIF(L$24:L253,\"WIN\",K$24:K253)-SUM(W$23:W252),\"\")","v":""},{"$f":"IF(AND(L253=\"LOSS\",L254<>\"LOSS\"),SUMIF(L$24:L253,\"LOSS\",K$24:K253)-SUM(X$23:X252),\"\")","v":""}]
[null,"Row 254 (231)",null,55,null,13256.908854295265,null,132.56908854295264,null,null,-132.56908854295264,"LOSS",{"$f":"IF(COUNTA($F$6:$F$10)=5,(F255-F24)/F24,\"\")","v":0.31243397657523131},2,"middle",null,null,null,null,null,null,null,{"$f":"IF(AND(L254=\"WIN\",L255<>\"WIN\"),SUMIF(L$24:L254,\"WIN\",K$24:K254)-SUM(W$23:W253),\"\")","v":""},{"$f":"IF(AND(L254=\"LOSS\",L255<>\"LOSS\"),SUMIF(L$24:L254,\"LOSS\",K$24:K254)-SUM(X$23:X253),\"\")","v":""}]
[null,"Row 255 (232)",null,62,null,13124.339765752313,null,131.24339765752313,null,null,-131.24339765752313,"LOSS",{"$f":"IF(COUNTA($F$6:$F$10)=5,(F256-F24)/F24,\"\")","v":0.29930963680947897},3,"last",null,null,null,null,null,null,null,{"$f":"IF(AND(L255=\"WIN\",L256<>\"WIN\"),SUMIF(L$24:L255,\"WIN\",K$24:K255)-SUM(W$23:W254),\"\")","v":""},{"$f":"IF(AND(L255=\"LOSS\",L256<>\"LOSS\"),SUMIF(L$24:L255,\"LOSS\",K$24:K255)-SUM(X$23:X254),\"\")","v":-397.7206564458811}]
[null,"Row 256 (233)",null,17,null,12993.09636809479,null,129.93096368094791,null,null,155.91715641713748,"WIN",{"$f":"IF(COUNTA($F$6:$F$10)=5,(F257-F24)/F24,\"\")","v":0.31490135245119272},1,"last",null,null,null,null,null,null,null,{"$f":"IF(AND(L256=\"WIN\",L257<>\"WIN\"),SUMIF(L$24:L256,\"WIN\",K$24:K256)-SUM(W$23:W255),\"\")","v":155.91715641713745},{"$f":"IF(AND(L256=\"LOSS\",L257<>\"LOSS\"),SUMIF(L$24:L256,\"LOSS\",K$24:K256)-SUM(X$23:X255),\"\")","v":""}]
[null,"Row 257 (234)",null,93,null,13149.013524511927,null,131.49013524511926,null,null,-131.49013524511926,"LOSS",{"$f":"IF(COUNTA($F$6:$F$10)=5,(F258-F24)/F24,\"\")","v":0.30175233892668074},1,"last",null,null,null,null,null,null,null,{"$f":"IF(AND(L257=\"WIN\",L258<>\"WIN\"),SUMIF(L$24:L257,\"WIN\",K$24:K257)-SUM(W$23:W256),\"\")","v":""},{"$f":"IF(AND(L257=\"LOSS\",L258<>\"LOSS\"),SUMIF(L$24:L257,\"LOSS\",K$24:K257)-SUM(X$23:X256),\"\")","v":-131.49013524511975}]
[null,"Row 258 (235)",null,42,null,13017.523389266807,null,130.17523389266807,null,null,156.21028067120167,"WIN",{"$f":"IF(COUNTA($F$6:$F$10)=5,(F259-F24)/F24,\"\")","v":0.31737336699380087},1,"last",null,null,null,null,null,null,null,{"$f":"IF(AND(L258=\"WIN\",L259<>\"WIN\"),SUMIF(L$24:L258,\"WIN\",K$24:K258)-SUM(W$23:W257),\"\")","v":156.21028067120278},{"$f":"IF(AND(L258=\"LOSS\",L259<>\"LOSS\"),SUMIF(L$24:L258,\"LOSS\",K$24:K258)-SUM(X$23:X257),\"\")","v":""}]
[null,"Row 259 (236)",null,81,null,13173.733669938008,null,131.73733669938008,null,null,-131.73733669938008,"LOSS",{"$f":"IF(COUNTA($F$6:$F$10)=5,(F260-F24)/F24,\"\")","v":0.30419963332386285},1,"new",null,null,null,null,null,null,null,{"$f":"IF(AND(L259=\"WIN\",L260<>\"WIN\"),SUMIF(L$24:L259,\"WIN\",K$24:K259)-SUM(W$23:W258),\"\")","v":""},{"$f":"IF(AND(L259=\"LOSS\",L260<>\"LOSS\"),SUMIF(L$24:L259,\"LOSS\",K$24:K259)-SUM(X$23:X258),\"\")","v":""}]
[null,"Row 260 (237)",null,57,null,13041.996333238629,null,130.41996333238629,null,null,-130.41996333238629,"LOSS",{"$f":"IF(COUNTA($F$6:$F$10)=5,(F261-F24)/F24,\"\")","v":0.29115763699062425},2,"last",null,null,null,null,null,null,null,{"$f":"IF(AND(L260=\"WIN\",L261<>\"WIN\"),SUMIF(L$24:L260,\"WIN\",K$24:K260)-SUM(W$23:W259),\"\")","v":""},{"$f":"IF(AND(L260=\"LOSS\",L261<>\"LOSS\"),SUMIF(L$24:L260,\"LOSS\",K$24:K260)-SUM(X$23:X259),\"\")","v":-262.15730003176577}]
[null,"Row 261 (238)",null,24,null,12911.576369906243,null,129.11576369906243,null,null,154.93891643887491,"WIN",{"$f":"IF(COUNTA($F$6:$F$10)=5,(F262-F24)/F24,\"\")","v":0.30665152863451184},1,"last",null,null,null,null,null,null,null,{"$f":"IF(AND(L261=\"WIN\",L262<>\"WIN\"),SUMIF(L$24:L261,\"WIN\",K$24:K261)-SUM(W$23:W260),\"\")","v":154.938916438874},{"$f":"IF(AND(L261=\"LOSS\",L262<>\"LOSS\"),SUMIF(L$24:L261,\"LOSS\",K$24:K261)-SUM(X$23:X260),\"\")","v":""}]
[null,"Row 262 (239)",null,92,null,13066.515286345119,null,130.6651528634512,null,null,-130.6651528634512,"LOSS",{"$f":"IF(COUNTA($F$6:$F$10)=5,(F263-F24)/F24,\"\")","v":0.29358501334816667},1,"new",null,null,null,null,null,null,null,{"$f":"IF(AND(L262=\"WIN\",L263<>\"WIN\"),SUMIF(L$24:L262,\"WIN\",K$24:K262)-SUM(W$23:W261),\"\")","v":""},{"$f":"IF(AND(L262=\"LOSS\",L263<>\"LOSS\"),SUMIF(L$24:L262,\"LOSS\",K$24:K262)-SUM(X$23:X261),\"\")","v":""}]
[null,"Row 263 (240)",null,56,null,12935.850133481666,null,129.35850133481668,null,null,-129.35850133481668,"LOSS",{"$f":"IF(COUNTA($F$6:$F$10)=5,(F264-F24)/F24,\"\")","v":0.28064916321468497},2,"last",null,null,null,null,null,null,null,{"$f":"IF(AND(L263=\"WIN\",L264<>\"WIN\"),SUMIF(L$24:L263,\"WIN\",K$24:K263)-SUM(W$23:W262),\"\")","v":""},{"$f":"IF(AND(L263=\"LOSS\",L264<>\"LOSS\"),SUMIF(L$24:L263,\"LOSS\",K$24:K263)-SUM(X$23:X262),\"\")","v":-260.02365419826856}]
[null,"Row 264 (241)",null,51,null,12806.49163214685,null,128.0649163214685,null,null,153.67789958576219,"WIN",{"$f":"IF(COUNTA($F$6:$F$10)=5,(F265-F24)/F24,\"\")","v":0.29601695317326121},1,"last",null,null,null,null,null,null,null,{"$f":"IF(AND(L264=\"WIN\",L265<>\"WIN\"),SUMIF(L$24:L264,\"WIN\",K$24:K264)-SUM(W$23:W263),\"\")","v":153.67789958576395},{"$f":"IF(AND(L264=\"LOSS\",L265<>\"LOSS\"),SUMIF(L$24:L264,\"LOSS\",K$24:K264)-SUM(X$23:X263),\"\")","v":""}]
[null,"Row 265 (242)",null,86,null,12960.169531732612,null,129.60169531732612,null,null,-129.60169531732612,"LOSS",{"$f":"IF(COUNTA($F$6:$F$10)=5,(F266-F24)/F24,\"\")","v":0.28305678364152864},1,"last",null,null,null,null,null,null,null,{"$f":"IF(AND(L265=\"WIN\",L266<>\"WIN\"),SUMIF(L$24:L265,\"WIN\",K$24:K265)-SUM(W$23:W264),\"\")","v":""},{"$f":"IF(AND(L265=\"LOSS\",L266<>\"LOSS\"),SUMIF(L$24:L265,\"LOSS\",K$24:K265)-SUM(X$23:X264),\"\")","v":-129.60169531732572}]
[null,"Row 266 (243)",null,11,null,12830.567836415286,null,128.30567836415287,null,null,153.96681403698344,"WIN",{"$f":"IF(COUNTA($F$6:$F$10)=5,(F267-F24)/F24,\"\")","v":0.29845346504522696},1,"new",null,null,null,null,null,null,null,{"$f":"IF(AND(L266=\"WIN\",L267<>\"WIN\"),SUMIF(L$24:L266,\"WIN\",K$24:K266)-SUM(W$23:W265),\"\")","v":""},{"$f":"IF(AND(L266=\"LOSS\",L267<>\"LOSS\"),SUMIF(L$24:L266,\"LOSS\",K$24:K266)-SUM(X$23:X265),\"\")","v":""}]
[null,"Row 267 (244)",null,15,null,12984.534650452269,null,129.84534650452269,null,null,155.81441580542722,"WIN",{"$f":"IF(COUNTA($F$6:$F$10)=5,(F268-F24)/F24,\"\")","v":0.31403490662576972},2,"last",null,null,null,null,null,null,null,{"$f":"IF(AND(L267=\"WIN\",L268<>\"WIN\"),SUMIF(L$24:L267,\"WIN\",K$24:K267)-SUM(W$23:W266),\"\")","v":309.78122984241054},{"$f":"IF(AND(L267=\"LOSS\",L268<>\"LOSS\"),SUMIF(L$24:L267,\"LOSS\",K$24:K267)-SUM(X$23:X266),\"\")","v":""}]
[null,"Row 268 (245)",null,94,null,13140.349066257697,null,131.40349066257698,null,null,-131.40349066257698,"LOSS",{"$f":"IF(COUNTA($F$6:$F$10)=5,(F269-F24)/F24,\"\")","v":0.30089455755951205},1,"new",null,null,null,null,null,null,null,{"$f":"IF(AND(L268=\"WIN\",L269<>\"WIN\"),SUMIF(L$24:L268,\"WIN\",K$24:K268)-SUM(W$23:W267),\"\")","v":""},{"$f":"IF(AND(L268=\"LOSS\",L269<>\"LOSS\"),SUMIF(L$24:L268,\"LOSS\",K$24:K268)-SUM(X$23:X267),\"\")","v":""}]
[null,"Row 269 (246)",null,95,null,13008.94557559512,null,130.08945575595121,null,null,-130.08945575595121,"LOSS",{"$f":"IF(COUNTA($F$6:$F$10)=5,(F270-F24)/F24,\"\")","v":0.28788561198391688},2,"last",null,null,null,null,null,null,null,{"$f":"IF(AND(L269=\"WIN\",L270<>\"WIN\"),SUMIF(L$24:L269,\"WIN\",K$24:K269)-SUM(W$23:W268),\"\")","v":""},{"$f":"IF(AND(L269=\"LOSS\",L270<>\"LOSS\"),SUMIF(L$24:L269,\"LOSS\",K$24:K269)-SUM(X$23:X268),\"\")","v":-261.49294641852794}]
[null,"Row 270 (247)",null,53,null,12878.856119839169,null,128.7885611983917,null,null,154.54627343807005,"WIN",{"$f":"IF(COUNTA($F$6:$F$10)=5,(F271-F24)/F24,\"\")","v":0.30334023932772397},1,"new",null,null,null,null,null,null,null,{"$f":"IF(AND(L270=\"WIN\",L271<>\"WIN\"),SUMIF(L$24:L270,\"WIN\",K$24:K270)-SUM(W$23:W269),\"\")","v":""},{"$f":"IF(AND(L270=\"LOSS\",L271<>\"LOSS\"),SUMIF(L$24:L270,\"LOSS\",K$24:K270)-SUM(X$23:X269),\"\")","v":""}]
[null,"Row 271 (248)",null,45,null,13033.40239327724,null,130.3340239327724,null,null,156.40082871932688,"WIN",{"$f":"IF(COUNTA($F$6:$F$10)=5,(F272-F24)/F24,\"\")","v":0.31898032219965661},2,"last",null,null,null,null,null,null,null,{"$f":"IF(AND(L271=\"WIN\",L272<>\"WIN\"),SUMIF(L$24:L271,\"WIN\",K$24:K271)-SUM(W$23:W270),\"\")","v":310.94710215739906},{"$f":"IF(AND(L271=\"LOSS\",L272<>\"LOSS\"),SUMIF(L$24:L271,\"LOSS\",K$24:K271)-SUM(X$23:X270),\"\")","v":""}]
[null,"Row 272 (249)",null,55,null,13189.803221996566,null,131.89803221996567,null,null,-131.89803221996567,"LOSS",{"$f":"IF(COUNTA($F$6:$F$10)=5,(F273-F24)/F24,\"\")","v":0.30579051897766002},1,"new",null,null,null,null,null,null,null,{"$f":"IF(AND(L272=\"WIN\",L273<>\"WIN\"),SUMIF(L$24:L272,\"WIN\",K$24:K272)-SUM(W$23:W271),\"\")","v":""},{"$f":"IF(AND(L272=\"LOSS\",L273<>\"LOSS\"),SUMIF(L$24:L272,\"LOSS\",K$24:K272)-SUM(X$23:X271),\"\")","v":""}]
[null,"Row 273 (250)",null,90,null,13057.9051897766,null,130.57905189776599,null,null,-130.57905189776599,"LOSS",{"$f":"IF(COUNTA($F$6:$F$10)=5,(F274-F24)/F24,\"\")","v":0.2927326137878834},2,"last",null,null,null,null,null,null,null,{"$f":"IF(AND(L273=\"WIN\",L274<>\"WIN\"),SUMIF(L$24:L273,\"WIN\",K$24:K273)-SUM(W$23:W272),\"\")","v":""},{"$f":"IF(AND(L273=\"LOSS\",L274<>\"LOSS\"),SUMIF(L$24:L273,\"LOSS\",K$24:K273)-SUM(X$23:X272),\"\")","v":-262.47708411773237}]
[null,"Row 274 (251)",null,40,null,12927.326137878834,null,129.27326137878833,null,null,155.12791365454601,"WIN",{"$f":"IF(COUNTA($F$6:$F$10)=5,(F275-F24)/F24,\"\")","v":0.30824540515333793},1,"new",null,null,null,null,null,null,null,{"$f":"IF(AND(L274=\"WIN\",L275<>\"WIN\"),SUMIF(L$24:L274,\"WIN\",K$24:K274)-SUM(W$23:W273),\"\")","v":""},{"$f":"IF(AND(L274=\"LOSS\",L275<>\"LOSS\"),SUMIF(L$24:L274,\"LOSS\",K$24:K274)-SUM(X$23:X273),\"\")","v":""}]
[null,"Row 275 (252)",null,13,null,13082.454051533379,null,130.82454051533381,null,null,156.98944861840056,"WIN",{"$f":"IF(COUNTA($F$6:$F$10)=5,(F276-F24)/F24,\"\")","v":0.32394435001517796},2,"last",null,null,null,null,null,null,null,{"$f":"IF(AND(L275=\"WIN\",L276<>\"WIN\"),SUMIF(L$24:L275,\"WIN\",K$24:K275)-SUM(W$23:W274),\"\")","v":312.1173622729475},{"$f":"IF(AND(L275=\"LOSS\",L276<>\"LOSS\"),SUMIF(L$24:L275,\"LOSS\",K$24:K275)-SUM(X$23:X274),\"\")","v":""}]
[null,"Row 276 (253)",null,83,null,13239.44350015178,null,132.39443500151779,null,null,-132.39443500151779,"LOSS",{"$f":"IF(COUNTA($F$6:$F$10)=5,(F277-F24)/F24,\"\")","v":0.31070490651502625},1,"last",null,null,null,null,null,null,null,{"$f":"IF(AND(L276=\"WIN\",L277<>\"WIN\"),SUMIF(L$24:L276,\"WIN\",K$24:K276)-SUM(W$23:W275),\"\")","v":""},{"$f":"IF(AND(L276=\"LOSS\",L277<>\"LOSS\"),SUMIF(L$24:L276,\"LOSS\",K$24:K276)-SUM(X$23:X275),\"\")","v":-132.39443500151901}]
[null,"Row 277 (254)",null,53,null,13107.049065150262,null,131.07049065150264,null,null,157.28458878180317,"WIN",{"$f":"IF(COUNTA($F$6:$F$10)=5,(F278-F24)/F24,\"\")","v":0.32643336539320661},1,"last",null,null,null,null,null,null,null,{"$f":"IF(AND(L277=\"WIN\",L278<>\"WIN\"),SUMIF(L$24:L277,\"WIN\",K$24:K277)-SUM(W$23:W276),\"\")","v":157.2845887818039},{"$f":"IF(AND(L277=\"LOSS\",L278<>\"LOSS\"),SUMIF(L$24:L277,\"LOSS\",K$24:K277)-SUM(X$23:X276),\"\")","v":""}]
[null,"Row 278 (255)",null,82,null,13264.333653932066,null,132.64333653932067,null,null,-132.64333653932067,"LOSS",{"$f":"IF(COUNTA($F$6:$F$10)=5,(F279-F24)/F24,\"\")","v":0.31316903173927457},1,"last",null,null,null,null,null,null,null,{"$f":"IF(AND(L278=\"WIN\",L279<>\"WIN\"),SUMIF(L$24:L278,\"WIN\",K$24:K278)-SUM(W$23:W277),\"\")","v":""},{"$f":"IF(AND(L278=\"LOSS\",L279<>\"LOSS\"),SUMIF(L$24:L278,\"LOSS\",K$24:K278)-SUM(X$23:X277),\"\")","v":-132.64333653932044}]
[null,"Row 279 (256)",null,26,null,13131.690317392746,null,131.31690317392747,null,null,157.58028380871295,"WIN",{"$f":"IF(COUNTA($F$6:$F$10)=5,(F280-F24)/F24,\"\")","v":0.32892706012014589},1,"new",null,null,null,null,null,null,null,{"$f":"IF(AND(L279=\"WIN\",L280<>\"WIN\"),SUMIF(L$24:L279,\"WIN\",K$24:K279)-SUM(W$23:W278),\"\")","v":""},{"$f":"IF(AND(L279=\"LOSS\",L280<>\"LOSS\"),SUMIF(L$24:L279,\"LOSS\",K$24:K279)-SUM(X$23:X278),\"\")","v":""}]
[null,"Row 280 (257)",null,18,null,13289.270601201459,null,132.8927060120146,null,null,159.4712472144175,"WIN",{"$f":"IF(COUNTA($F$6:$F$10)=5,(F281-F24)/F24,\"\")","v":0.34487418484158772},2,"last",null,null,null,null,null,null,null,{"$f":"IF(AND(L280=\"WIN\",L281<>\"WIN\"),SUMIF(L$24:L280,\"WIN\",K$24:K280)-SUM(W$23:W279),\"\")","v":317.05153102313125},{"$f":"IF(AND(L280=\"LOSS\",L281<>\"LOSS\"),SUMIF(L$24:L280,\"LOSS\",K$24:K280)-SUM(X$23:X279),\"\")","v":""}]
[null,"Row 281 (258)",null,64,null,13448.741848415877,null,{"$f":"IF(COUNTBLANK($F$6:$F$10),\"\",F281*$F$7)","v":134.48741848415878},null,null,-134.48741848415878,{"$f":"IF(D281=\"\",\"\",IF(D281<$F$8,\"WIN\",\"LOSS\"))","v":"LOSS"},{"$f":"IF(COUNTA($F$6:$F$10)=5,(F282-F24)/F24,\"\")","v":0.33142544299317178},{"$f":"IF(L281=L280,N280+1,1)","v":1},{"$f":"IF(N281=1,IF(N282=1,\"last\",\"new\"),IF(N282=1,\"last\",\"middle\"))","v":"new"},null,null,null,null,null,null,null,{"$f":"IF(AND(L281=\"WIN\",L282<>\"WIN\"),SUMIF(L$24:L281,\"WIN\",K$24:K281)-SUM(W$23:W280),\"\")","v":""},{"$f":"IF(AND(L281=\"LOSS\",L282<>\"LOSS\"),SUMIF(L$24:L281,\"LOSS\",K$24:K281)-SUM(X$23:X280),\"\")","v":""}]
[null,"Row 282 (259)",null,63,null,{"$f":"IF(COUNTBLANK($F$6:$F$10),\"\",IF(D281<$F$8,(1+$F$7*$F$9)*F281-$F$10,(1-$F$7)*F281-$F$10))","v":13314.254429931718},null,133.14254429931719,null,null,{"$f":"IF(COUNTBLANK($F$6:$F$10),\"\", IF(L282=\"win\", H282*$F$9-$F$10, IF(L282=\"loss\", -H282-$F$10)))","v":-133.14254429931719},"LOSS",{"$f":"IF(COUNTA($F$6:$F$10)=5,(F283-F24)/F24,\"\")","v":0.31811118856324011},2,"middle",null,null,null,null,null,null,null,{"$f":"IF(AND(L282=\"WIN\",L283<>\"WIN\"),SUMIF(L$24:L282,\"WIN\",K$24:K282)-SUM(W$23:W281),\"\")","v":""},{"$f":"IF(AND(L282=\"LOSS\",L283<>\"LOSS\"),SUMIF(L$24:L282,\"LOSS\",K$24:K282)-SUM(X$23:X281),\"\")","v":""}]
[null,"Row 283 (260)",null,81,null,13181.111885632401,null,131.81111885632401,null,null,-131.81111885632401,"LOSS",{"$f":"IF(COUNTA($F$6:$F$10)=5,(F284-F24)/F24,\"\")","v":0.30493007667760774},3,"middle",null,null,null,null,null,null,null,{"$f":"IF(AND(L283=\"WIN\",L284<>\"WIN\"),SUMIF(L$24:L283,\"WIN\",K$24:K283)-SUM(W$23:W282),\"\")","v":""},{"$f":"IF(AND(L283=\"LOSS\",L284<>\"LOSS\"),SUMIF(L$24:L283,\"LOSS\",K$24:K283)-SUM(X$23:X282),\"\")","v":""}]
[null,"Row 284 (261)",null,58,null,13049.300766776078,null,130.49300766776076,null,null,-130.49300766776076,"LOSS",{"$f":"IF(COUNTA($F$6:$F$10)=5,(F285-F24)/F24,\"\")","v":0.29188077591083167},4,"last",null,null,null,null,null,null,null,{"$f":"IF(AND(L284=\"WIN\",L285<>\"WIN\"),SUMIF(L$24:L284,\"WIN\",K$24:K284)-SUM(W$23:W283),\"\")","v":""},{"$f":"IF(AND(L284=\"LOSS\",L285<>\"LOSS\"),SUMIF(L$24:L284,\"LOSS\",K$24:K284)-SUM(X$23:X283),\"\")","v":-529.93408930755686}]
[null,"Row 285 (262)",null,40,null,12918.807759108317,null,129.18807759108316,null,null,155.02569310929979,"WIN",{"$f":"IF(COUNTA($F$6:$F$10)=5,(F286-F24)/F24,\"\")","v":0.30738334522176158},1,"last",null,null,null,null,null,null,null,{"$f":"IF(AND(L285=\"WIN\",L286<>\"WIN\"),SUMIF(L$24:L285,\"WIN\",K$24:K285)-SUM(W$23:W284),\"\")","v":155.02569310929903},{"$f":"IF(AND(L285=\"LOSS\",L286<>\"LOSS\"),SUMIF(L$24:L285,\"LOSS\",K$24:K285)-SUM(X$23:X284),\"\")","v":""}]
[null,"Row 286 (263)",null,67,null,13073.833452217616,null,130.73833452217616,null,null,-130.73833452217616,"LOSS",{"$f":"IF(COUNTA($F$6:$F$10)=5,(F287-F24)/F24,\"\")","v":0.29430951176954384},1,"last",null,null,null,null,null,null,null,{"$f":"IF(AND(L286=\"WIN\",L287<>\"WIN\"),SUMIF(L$24:L286,\"WIN\",K$24:K286)-SUM(W$23:W285),\"\")","v":""},{"$f":"IF(AND(L286=\"LOSS\",L287<>\"LOSS\"),SUMIF(L$24:L286,\"LOSS\",K$24:K286)-SUM(X$23:X285),\"\")","v":-130.73833452217514}]
[null,"Row 287 (264)",null,30,null,12943.095117695439,null,129.43095117695438,null,null,155.31714141234525,"WIN",{"$f":"IF(COUNTA($F$6:$F$10)=5,(F288-F24)/F24,\"\")","v":0.30984122591077851},1,"new",null,null,null,null,null,null,null,{"$f":"IF(AND(L287=\"WIN\",L288<>\"WIN\"),SUMIF(L$24:L287,\"WIN\",K$24:K287)-SUM(W$23:W286),\"\")","v":""},{"$f":"IF(AND(L287=\"LOSS\",L288<>\"LOSS\"),SUMIF(L$24:L287,\"LOSS\",K$24:K287)-SUM(X$23:X286),\"\")","v":""}]
[null,"Row 288 (265)",null,36,null,13098.412259107785,null,130.98412259107786,null,null,157.18094710929344,"WIN",{"$f":"IF(COUNTA($F$6:$F$10)=5,(F289-F24)/F24,\"\")","v":0.32555932062170778},2,"middle",null,null,null,null,null,null,null,{"$f":"IF(AND(L288=\"WIN\",L289<>\"WIN\"),SUMIF(L$24:L288,\"WIN\",K$24:K288)-SUM(W$23:W287),\"\")","v":""},{"$f":"IF(AND(L288=\"LOSS\",L289<>\"LOSS\"),SUMIF(L$24:L288,\"LOSS\",K$24:K288)-SUM(X$23:X287),\"\")","v":""}]
[null,"Row 289 (266)",null,14,null,13255.593206217078,null,132.55593206217077,null,null,159.06711847460491,"WIN",{"$f":"IF(COUNTA($F$6:$F$10)=5,(F290-F24)/F24,\"\")","v":0.34146603246916818},3,"middle",null,null,null,null,null,null,null,{"$f":"IF(AND(L289=\"WIN\",L290<>\"WIN\"),SUMIF(L$24:L289,\"WIN\",K$24:K289)-SUM(W$23:W288),\"\")","v":""},{"$f":"IF(AND(L289=\"LOSS\",L290<>\"LOSS\"),SUMIF(L$24:L289,\"LOSS\",K$24:K289)-SUM(X$23:X288),\"\")","v":""}]
[null,"Row 290 (267)",null,49,null,13414.660324691682,null,134.14660324691681,null,null,160.97592389630017,"WIN",{"$f":"IF(COUNTA($F$6:$F$10)=5,(F291-F24)/F24,\"\")","v":0.35756362485879817},4,"last",null,null,null,null,null,null,null,{"$f":"IF(AND(L290=\"WIN\",L291<>\"WIN\"),SUMIF(L$24:L290,\"WIN\",K$24:K290)-SUM(W$23:W289),\"\")","v":632.54113089254679},{"$f":"IF(AND(L290=\"LOSS\",L291<>\"LOSS\"),SUMIF(L$24:L290,\"LOSS\",K$24:K290)-SUM(X$23:X289),\"\")","v":""}]
[null,"Row 291 (268)",null,72,null,13575.636248587982,null,135.75636248587983,null,null,-135.75636248587983,"LOSS",{"$f":"IF(COUNTA($F$6:$F$10)=5,(F292-F24)/F24,\"\")","v":0.34398798861021024},1,"last",null,null,null,null,null,null,null,{"$f":"IF(AND(L291=\"WIN\",L292<>\"WIN\"),SUMIF(L$24:L291,\"WIN\",K$24:K291)-SUM(W$23:W290),\"\")","v":""},{"$f":"IF(AND(L291=\"LOSS\",L292<>\"LOSS\"),SUMIF(L$24:L291,\"LOSS\",K$24:K291)-SUM(X$23:X290),\"\")","v":-135.75636248588125}]
[null,"Row 292 (269)",null,4,null,13439.879886102102,null,134.39879886102102,null,null,161.27855863322523,"WIN",{"$f":"IF(COUNTA($F$6:$F$10)=5,(F293-F24)/F24,\"\")","v":0.36011584447353273},1,"new",null,null,null,null,null,null,null,{"$f":"IF(AND(L292=\"WIN\",L293<>\"WIN\"),SUMIF(L$24:L292,\"WIN\",K$24:K292)-SUM(W$23:W291),\"\")","v":""},{"$f":"IF(AND(L292=\"LOSS\",L293<>\"LOSS\"),SUMIF(L$24:L292,\"LOSS\",K$24:K292)-SUM(X$23:X291),\"\")","v":""}]
[null,"Row 293 (270)",null,19,null,13601.158444735327,null,136.01158444735327,null,null,163.21390133682391,"WIN",{"$f":"IF(COUNTA($F$6:$F$10)=5,(F294-F24)/F24,\"\")","v":0.37643723460721501},2,"last",null,null,null,null,null,null,null,{"$f":"IF(AND(L293=\"WIN\",L294<>\"WIN\"),SUMIF(L$24:L293,\"WIN\",K$24:K293)-SUM(W$23:W292),\"\")","v":324.49245997004982},{"$f":"IF(AND(L293=\"LOSS\",L294<>\"LOSS\"),SUMIF(L$24:L293,\"LOSS\",K$24:K293)-SUM(X$23:X292),\"\")","v":""}]
[null,"Row 294 (271)",null,58,null,13764.37234607215,null,137.6437234607215,null,null,-137.6437234607215,"LOSS",{"$f":"IF(COUNTA($F$6:$F$10)=5,(F295-F24)/F24,\"\")","v":0.36267286226114281},1,"last",null,null,null,null,null,null,null,{"$f":"IF(AND(L294=\"WIN\",L295<>\"WIN\"),SUMIF(L$24:L294,\"WIN\",K$24:K294)-SUM(W$23:W293),\"\")","v":""},{"$f":"IF(AND(L294=\"LOSS\",L295<>\"LOSS\"),SUMIF(L$24:L294,\"LOSS\",K$24:K294)-SUM(X$23:X293),\"\")","v":-137.64372346072196}]
[null,"Row 295 (272)",null,45,null,13626.728622611428,null,136.26728622611429,null,null,163.52074347133714,"WIN",{"$f":"IF(COUNTA($F$6:$F$10)=5,(F296-F24)/F24,\"\")","v":0.37902493660827657},1,"new",null,null,null,null,null,null,null,{"$f":"IF(AND(L295=\"WIN\",L296<>\"WIN\"),SUMIF(L$24:L295,\"WIN\",K$24:K295)-SUM(W$23:W294),\"\")","v":""},{"$f":"IF(AND(L295=\"LOSS\",L296<>\"LOSS\"),SUMIF(L$24:L295,\"LOSS\",K$24:K295)-SUM(X$23:X294),\"\")","v":""}]
[null,"Row 296 (273)",null,3,null,13790.249366082766,null,137.90249366082767,null,null,165.4829923929932,"WIN",{"$f":"IF(COUNTA($F$6:$F$10)=5,(F297-F24)/F24,\"\")","v":0.39557323584757598},2,"middle",null,null,null,null,null,null,null,{"$f":"IF(AND(L296=\"WIN\",L297<>\"WIN\"),SUMIF(L$24:L296,\"WIN\",K$24:K296)-SUM(W$23:W295),\"\")","v":""},{"$f":"IF(AND(L296=\"LOSS\",L297<>\"LOSS\"),SUMIF(L$24:L296,\"LOSS\",K$24:K296)-SUM(X$23:X295),\"\")","v":""}]
[null,"Row 297 (274)",null,7,null,13955.73235847576,null,139.5573235847576,null,null,167.46878830170911,"WIN",{"$f":"IF(COUNTA($F$6:$F$10)=5,(F298-F24)/F24,\"\")","v":0.41232011467774682},3,"last",null,null,null,null,null,null,null,{"$f":"IF(AND(L297=\"WIN\",L298<>\"WIN\"),SUMIF(L$24:L297,\"WIN\",K$24:K297)-SUM(W$23:W296),\"\")","v":496.47252416604169},{"$f":"IF(AND(L297=\"LOSS\",L298<>\"LOSS\"),SUMIF(L$24:L297,\"LOSS\",K$24:K297)-SUM(X$23:X296),\"\")","v":""}]
[null,"Row 298 (275)",null,74,null,14123.201146777468,null,141.2320114677747,null,null,-141.2320114677747,"LOSS",{"$f":"IF(COUNTA($F$6:$F$10)=5,(F299-F24)/F24,\"\")","v":0.39819691353096931},1,"new",null,null,null,null,null,null,null,{"$f":"IF(AND(L298=\"WIN\",L299<>\"WIN\"),SUMIF(L$24:L298,\"WIN\",K$24:K298)-SUM(W$23:W297),\"\")","v":""},{"$f":"IF(AND(L298=\"LOSS\",L299<>\"LOSS\"),SUMIF(L$24:L298,\"LOSS\",K$24:K298)-SUM(X$23:X297),\"\")","v":""}]
[null,"Row 299 (276)",null,58,null,13981.969135309693,null,139.81969135309694,null,null,-139.81969135309694,"LOSS",{"$f":"IF(COUNTA($F$6:$F$10)=5,(F300-F24)/F24,\"\")","v":0.38421494439565956},2,"middle",null,null,null,null,null,null,null,{"$f":"IF(AND(L299=\"WIN\",L300<>\"WIN\"),SUMIF(L$24:L299,\"WIN\",K$24:K299)-SUM(W$23:W298),\"\")","v":""},{"$f":"IF(AND(L299=\"LOSS\",L300<>\"LOSS\"),SUMIF(L$24:L299,\"LOSS\",K$24:K299)-SUM(X$23:X298),\"\")","v":""}]
[null,"Row 300 (277)",null,94,null,13842.149443956596,null,138.42149443956598,null,null,-138.42149443956598,"LOSS",{"$f":"IF(COUNTA($F$6:$F$10)=5,(F301-F24)/F24,\"\")","v":0.37037279495170294},3,"middle",null,null,null,null,null,null,null,{"$f":"IF(AND(L300=\"WIN\",L301<>\"WIN\"),SUMIF(L$24:L300,\"WIN\",K$24:K300)-SUM(W$23:W299),\"\")","v":""},{"$f":"IF(AND(L300=\"LOSS\",L301<>\"LOSS\"),SUMIF(L$24:L300,\"LOSS\",K$24:K300)-SUM(X$23:X299),\"\")","v":""}]
[null,"Row 301 (278)",null,60,null,13703.72794951703,null,137.03727949517031,null,null,-137.03727949517031,"LOSS",{"$f":"IF(COUNTA($F$6:$F$10)=5,(F302-F24)/F24,\"\")","v":0.35666906700218587},4,"middle",null,null,null,null,null,null,null,{"$f":"IF(AND(L301=\"WIN\",L302<>\"WIN\"),SUMIF(L$24:L301,\"WIN\",K$24:K301)-SUM(W$23:W300),\"\")","v":""},{"$f":"IF(AND(L301=\"LOSS\",L302<>\"LOSS\"),SUMIF(L$24:L301,\"LOSS\",K$24:K301)-SUM(X$23:X300),\"\")","v":""}]
[null,"Row 302 (279)",null,81,null,13566.690670021859,null,135.66690670021859,null,null,-135.66690670021859,"LOSS",{"$f":"IF(COUNTA($F$6:$F$10)=5,(F303-F24)/F24,\"\")","v":0.34310237633216401},5,"last",null,null,null,null,null,null,null,{"$f":"IF(AND(L302=\"WIN\",L303<>\"WIN\"),SUMIF(L$24:L302,\"WIN\",K$24:K302)-SUM(W$23:W301),\"\")","v":""},{"$f":"IF(AND(L302=\"LOSS\",L303<>\"LOSS\"),SUMIF(L$24:L302,\"LOSS\",K$24:K302)-SUM(X$23:X301),\"\")","v":-692.17738345582256}]
[null,"Row 303 (280)",null,19,null,13431.02376332164,null,134.31023763321642,null,null,161.17228515985968,"WIN",{"$f":"IF(COUNTA($F$6:$F$10)=5,(F304-F24)/F24,\"\")","v":0.35921960484815008},1,"last",null,null,null,null,null,null,null,{"$f":"IF(AND(L303=\"WIN\",L304<>\"WIN\"),SUMIF(L$24:L303,\"WIN\",K$24:K303)-SUM(W$23:W302),\"\")","v":161.17228515986062},{"$f":"IF(AND(L303=\"LOSS\",L304<>\"LOSS\"),SUMIF(L$24:L303,\"LOSS\",K$24:K303)-SUM(X$23:X302),\"\")","v":""}]
[null,"Row 304 (281)",null,55,null,13592.196048481501,null,135.921960484815,null,null,-135.921960484815,"LOSS",{"$f":"IF(COUNTA($F$6:$F$10)=5,(F305-F24)/F24,\"\")","v":0.34562740879966858},1,"last",null,null,null,null,null,null,null,{"$f":"IF(AND(L304=\"WIN\",L305<>\"WIN\"),SUMIF(L$24:L304,\"WIN\",K$24:K304)-SUM(W$23:W303),\"\")","v":""},{"$f":"IF(AND(L304=\"LOSS\",L305<>\"LOSS\"),SUMIF(L$24:L304,\"LOSS\",K$24:K304)-SUM(X$23:X303),\"\")","v":-135.92196048481492}]
[null,"Row 305 (282)",null,8,null,13456.274087996686,null,134.56274087996687,null,null,161.47528905596025,"WIN",{"$f":"IF(COUNTA($F$6:$F$10)=5,(F306-F24)/F24,\"\")","v":0.3617749377052647},1,"new",null,null,null,null,null,null,null,{"$f":"IF(AND(L305=\"WIN\",L306<>\"WIN\"),SUMIF(L$24:L305,\"WIN\",K$24:K305)-SUM(W$23:W304),\"\")","v":""},{"$f":"IF(AND(L305=\"LOSS\",L306<>\"LOSS\"),SUMIF(L$24:L305,\"LOSS\",K$24:K305)-SUM(X$23:X304),\"\")","v":""}]
[null,"Row 306 (283)",null,4,null,13617.749377052647,null,136.17749377052647,null,null,163.41299252463176,"WIN",{"$f":"IF(COUNTA($F$6:$F$10)=5,(F307-F24)/F24,\"\")","v":0.37811623695772795},2,"last",null,null,null,null,null,null,null,{"$f":"IF(AND(L306=\"WIN\",L307<>\"WIN\"),SUMIF(L$24:L306,\"WIN\",K$24:K306)-SUM(W$23:W305),\"\")","v":324.88828158059187},{"$f":"IF(AND(L306=\"LOSS\",L307<>\"LOSS\"),SUMIF(L$24:L306,\"LOSS\",K$24:K306)-SUM(X$23:X305),\"\")","v":""}]
[null,"Row 307 (284)",null,68,null,13781.16236957728,null,137.81162369577279,null,null,-137.81162369577279,"LOSS",{"$f":"IF(COUNTA($F$6:$F$10)=5,(F308-F24)/F24,\"\")","v":0.36433507458815073},1,"new",null,null,null,null,null,null,null,{"$f":"IF(AND(L307=\"WIN\",L308<>\"WIN\"),SUMIF(L$24:L307,\"WIN\",K$24:K307)-SUM(W$23:W306),\"\")","v":""},{"$f":"IF(AND(L307=\"LOSS\",L308<>\"LOSS\"),SUMIF(L$24:L307,\"LOSS\",K$24:K307)-SUM(X$23:X306),\"\")","v":""}]
[null,"Row 308 (285)",null,80,null,13643.350745881507,null,136.43350745881509,null,null,-136.43350745881509,"LOSS",{"$f":"IF(COUNTA($F$6:$F$10)=5,(F309-F24)/F24,\"\")","v":0.35069172384226932},2,"last",null,null,null,null,null,null,null,{"$f":"IF(AND(L308=\"WIN\",L309<>\"WIN\"),SUMIF(L$24:L308,\"WIN\",K$24:K308)-SUM(W$23:W307),\"\")","v":""},{"$f":"IF(AND(L308=\"LOSS\",L309<>\"LOSS\"),SUMIF(L$24:L308,\"LOSS\",K$24:K308)-SUM(X$23:X307),\"\")","v":-274.24513115458831}]
[null,"Row 309 (286)",null,37,null,13506.917238422693,null,135.06917238422693,null,null,162.08300686107231,"WIN",{"$f":"IF(COUNTA($F$6:$F$10)=5,(F310-F24)/F24,\"\")","v":0.3669000245283765},1,"new",null,null,null,null,null,null,null,{"$f":"IF(AND(L309=\"WIN\",L310<>\"WIN\"),SUMIF(L$24:L309,\"WIN\",K$24:K309)-SUM(W$23:W308),\"\")","v":""},{"$f":"IF(AND(L309=\"LOSS\",L310<>\"LOSS\"),SUMIF(L$24:L309,\"LOSS\",K$24:K309)-SUM(X$23:X308),\"\")","v":""}]
[null,"Row 310 (287)",null,11,null,13669.000245283765,null,136.69000245283766,null,null,164.0280029434052,"WIN",{"$f":"IF(COUNTA($F$6:$F$10)=5,(F311-F24)/F24,\"\")","v":0.38330282482271705},2,"middle",null,null,null,null,null,null,null,{"$f":"IF(AND(L310=\"WIN\",L311<>\"WIN\"),SUMIF(L$24:L310,\"WIN\",K$24:K310)-SUM(W$23:W309),\"\")","v":""},{"$f":"IF(AND(L310=\"LOSS\",L311<>\"LOSS\"),SUMIF(L$24:L310,\"LOSS\",K$24:K310)-SUM(X$23:X309),\"\")","v":""}]
[null,"Row 311 (288)",null,19,null,13833.02824822717,null,138.33028248227171,null,null,165.99633897872604,"WIN",{"$f":"IF(COUNTA($F$6:$F$10)=5,(F312-F24)/F24,\"\")","v":0.39990245872058966},3,"last",null,null,null,null,null,null,null,{"$f":"IF(AND(L311=\"WIN\",L312<>\"WIN\"),SUMIF(L$24:L311,\"WIN\",K$24:K311)-SUM(W$23:W310),\"\")","v":492.10734878320363},{"$f":"IF(AND(L311=\"LOSS\",L312<>\"LOSS\"),SUMIF(L$24:L311,\"LOSS\",K$24:K311)-SUM(X$23:X310),\"\")","v":""}]
[null,"Row 312 (289)",null,67,null,13999.024587205897,null,139.99024587205898,null,null,-139.99024587205898,"LOSS",{"$f":"IF(COUNTA($F$6:$F$10)=5,(F313-F24)/F24,\"\")","v":0.38590343413338379},1,"last",null,null,null,null,null,null,null,{"$f":"IF(AND(L312=\"WIN\",L313<>\"WIN\"),SUMIF(L$24:L312,\"WIN\",K$24:K312)-SUM(W$23:W311),\"\")","v":""},{"$f":"IF(AND(L312=\"LOSS\",L313<>\"LOSS\"),SUMIF(L$24:L312,\"LOSS\",K$24:K312)-SUM(X$23:X311),\"\")","v":-139.99024587206077}]
[null,"Row 313 (290)",null,39,null,13859.034341333838,null,138.59034341333839,null,null,166.30841209600607,"WIN",{"$f":"IF(COUNTA($F$6:$F$10)=5,(F314-F24)/F24,\"\")","v":0.40253427534298442},1,"new",null,null,null,null,null,null,null,{"$f":"IF(AND(L313=\"WIN\",L314<>\"WIN\"),SUMIF(L$24:L313,\"WIN\",K$24:K313)-SUM(W$23:W312),\"\")","v":""},{"$f":"IF(AND(L313=\"LOSS\",L314<>\"LOSS\"),SUMIF(L$24:L313,\"LOSS\",K$24:K313)-SUM(X$23:X312),\"\")","v":""}]
[null,"Row 314 (291)",null,39,null,14025.342753429844,null,140.25342753429845,null,null,168.30411304115813,"WIN",{"$f":"IF(COUNTA($F$6:$F$10)=5,(F315-F24)/F24,\"\")","v":0.4193646866471003},2,"middle",null,null,null,null,null,null,null,{"$f":"IF(AND(L314=\"WIN\",L315<>\"WIN\"),SUMIF(L$24:L314,\"WIN\",K$24:K314)-SUM(W$23:W313),\"\")","v":""},{"$f":"IF(AND(L314=\"LOSS\",L315<>\"LOSS\"),SUMIF(L$24:L314,\"LOSS\",K$24:K314)-SUM(X$23:X313),\"\")","v":""}]
[null,"Row 315 (292)",null,21,null,14193.646866471003,null,141.93646866471002,null,null,170.32376239765202,"WIN",{"$f":"IF(COUNTA($F$6:$F$10)=5,(F316-F24)/F24,\"\")","v":0.43639706288686558},3,"last",null,null,null,null,null,null,null,{"$f":"IF(AND(L315=\"WIN\",L316<>\"WIN\"),SUMIF(L$24:L315,\"WIN\",K$24:K315)-SUM(W$23:W314),\"\")","v":504.93628753481607},{"$f":"IF(AND(L315=\"LOSS\",L316<>\"LOSS\"),SUMIF(L$24:L315,\"LOSS\",K$24:K315)-SUM(X$23:X314),\"\")","v":""}]
[null,"Row 316 (293)",null,81,null,14363.970628868656,null,143.63970628868657,null,null,-143.63970628868657,"LOSS",{"$f":"IF(COUNTA($F$6:$F$10)=5,(F317-F24)/F24,\"\")","v":0.42203309225799696},1,"new",null,null,null,null,null,null,null,{"$f":"IF(AND(L316=\"WIN\",L317<>\"WIN\"),SUMIF(L$24:L316,\"WIN\",K$24:K316)-SUM(W$23:W315),\"\")","v":""},{"$f":"IF(AND(L316=\"LOSS\",L317<>\"LOSS\"),SUMIF(L$24:L316,\"LOSS\",K$24:K316)-SUM(X$23:X315),\"\")","v":""}]
[null,"Row 317 (294)",null,73,null,14220.330922579969,null,142.2033092257997,null,null,-142.2033092257997,"LOSS",{"$f":"IF(COUNTA($F$6:$F$10)=5,(F318-F24)/F24,\"\")","v":0.40781276133541688},2,"last",null,null,null,null,null,null,null,{"$f":"IF(AND(L317=\"WIN\",L318<>\"WIN\"),SUMIF(L$24:L317,\"WIN\",K$24:K317)-SUM(W$23:W316),\"\")","v":""},{"$f":"IF(AND(L317=\"LOSS\",L318<>\"LOSS\"),SUMIF(L$24:L317,\"LOSS\",K$24:K317)-SUM(X$23:X316),\"\")","v":-285.84301551448516}]
[null,"Row 318 (295)",null,53,null,14078.127613354169,null,140.7812761335417,null,null,168.93753136025003,"WIN",{"$f":"IF(COUNTA($F$6:$F$10)=5,(F319-F24)/F24,\"\")","v":0.42470651447144192},1,"new",null,null,null,null,null,null,null,{"$f":"IF(AND(L318=\"WIN\",L319<>\"WIN\"),SUMIF(L$24:L318,\"WIN\",K$24:K318)-SUM(W$23:W317),\"\")","v":""},{"$f":"IF(AND(L318=\"LOSS\",L319<>\"LOSS\"),SUMIF(L$24:L318,\"LOSS\",K$24:K318)-SUM(X$23:X317),\"\")","v":""}]
[null,"Row 319 (296)",null,23,null,14247.065144714419,null,142.47065144714421,null,null,170.96478173657303,"WIN",{"$f":"IF(COUNTA($F$6:$F$10)=5,(F320-F24)/F24,\"\")","v":0.4418029926450992},2,"middle",null,null,null,null,null,null,null,{"$f":"IF(AND(L319=\"WIN\",L320<>\"WIN\"),SUMIF(L$24:L319,\"WIN\",K$24:K319)-SUM(W$23:W318),\"\")","v":""},{"$f":"IF(AND(L319=\"LOSS\",L320<>\"LOSS\"),SUMIF(L$24:L319,\"LOSS\",K$24:K319)-SUM(X$23:X318),\"\")","v":""}]
[null,"Row 320 (297)",null,4,null,14418.029926450992,null,144.18029926450993,null,null,173.01635911741189,"WIN",{"$f":"IF(COUNTA($F$6:$F$10)=5,(F321-F24)/F24,\"\")","v":0.45910462855684037},3,"middle",null,null,null,null,null,null,null,{"$f":"IF(AND(L320=\"WIN\",L321<>\"WIN\"),SUMIF(L$24:L320,\"WIN\",K$24:K320)-SUM(W$23:W319),\"\")","v":""},{"$f":"IF(AND(L320=\"LOSS\",L321<>\"LOSS\"),SUMIF(L$24:L320,\"LOSS\",K$24:K320)-SUM(X$23:X319),\"\")","v":""}]
[null,"Row 321 (298)",null,35,null,14591.046285568404,null,145.91046285568405,null,null,175.09255542682084,"WIN",{"$f":"IF(COUNTA($F$6:$F$10)=5,(F322-F24)/F24,\"\")","v":0.47661388409952249},4,"middle",null,null,null,null,null,null,null,{"$f":"IF(AND(L321=\"WIN\",L322<>\"WIN\"),SUMIF(L$24:L321,\"WIN\",K$24:K321)-SUM(W$23:W320),\"\")","v":""},{"$f":"IF(AND(L321=\"LOSS\",L322<>\"LOSS\"),SUMIF(L$24:L321,\"LOSS\",K$24:K321)-SUM(X$23:X320),\"\")","v":""}]
[null,"Row 322 (299)",null,35,null,14766.138840995225,null,147.66138840995225,null,null,177.1936660919427,"WIN",{"$f":"IF(COUNTA($F$6:$F$10)=5,(F323-F24)/F24,\"\")","v":0.49433325070871686},5,"middle",null,null,null,null,null,null,null,{"$f":"IF(AND(L322=\"WIN\",L323<>\"WIN\"),SUMIF(L$24:L322,\"WIN\",K$24:K322)-SUM(W$23:W321),\"\")","v":""},{"$f":"IF(AND(L322=\"LOSS\",L323<>\"LOSS\"),SUMIF(L$24:L322,\"LOSS\",K$24:K322)-SUM(X$23:X321),\"\")","v":""}]
[null,"Row 323 (300)",null,40,null,14943.332507087169,null,149.43332507087169,null,null,179.31999008504602,"WIN",{"$f":"IF(COUNTA($F$6:$F$10)=5,(F324-F24)/F24,\"\")","v":0.51226524971722154},6,"middle",null,null,null,null,null,null,null,{"$f":"IF(AND(L323=\"WIN\",L324<>\"WIN\"),SUMIF(L$24:L323,\"WIN\",K$24:K323)-SUM(W$23:W322),\"\")","v":""},{"$f":"IF(AND(L323=\"LOSS\",L324<>\"LOSS\"),SUMIF(L$24:L323,\"LOSS\",K$24:K323)-SUM(X$23:X322),\"\")","v":""}]
[null,"Row 324 (301)",null,34,null,15122.652497172216,null,151.22652497172217,null,null,181.47182996606659,"WIN",{"$f":"IF(COUNTA($F$6:$F$10)=5,(F325-F24)/F24,\"\")","v":0.53041243271382832},7,"middle",null,null,null,null,null,null,null,{"$f":"IF(AND(L324=\"WIN\",L325<>\"WIN\"),SUMIF(L$24:L324,\"WIN\",K$24:K324)-SUM(W$23:W323),\"\")","v":""},{"$f":"IF(AND(L324=\"LOSS\",L325<>\"LOSS\"),SUMIF(L$24:L324,\"LOSS\",K$24:K324)-SUM(X$23:X323),\"\")","v":""}]
[null,"Row 325 (302)",null,16,null,15304.124327138283,null,153.04124327138283,null,null,183.64949192565939,"WIN",{"$f":"IF(COUNTA($F$6:$F$10)=5,(F326-F24)/F24,\"\")","v":0.54877738190639425},8,"middle",null,null,null,null,null,null,null,{"$f":"IF(AND(L325=\"WIN\",L326<>\"WIN\"),SUMIF(L$24:L325,\"WIN\",K$24:K325)-SUM(W$23:W324),\"\")","v":""},{"$f":"IF(AND(L325=\"LOSS\",L326<>\"LOSS\"),SUMIF(L$24:L325,\"LOSS\",K$24:K325)-SUM(X$23:X324),\"\")","v":""}]
[null,"Row 326 (303)",null,1,null,15487.773819063943,null,154.87773819063943,null,null,185.85328582876733,"WIN",{"$f":"IF(COUNTA($F$6:$F$10)=5,(F327-F24)/F24,\"\")","v":0.567362710489271},9,"last",null,null,null,null,null,null,null,{"$f":"IF(AND(L326=\"WIN\",L327<>\"WIN\"),SUMIF(L$24:L326,\"WIN\",K$24:K326)-SUM(W$23:W325),\"\")","v":1595.4994915385396},{"$f":"IF(AND(L326=\"LOSS\",L327<>\"LOSS\"),SUMIF(L$24:L326,\"LOSS\",K$24:K326)-SUM(X$23:X325),\"\")","v":""}]
[null,"Row 327 (304)",null,55,null,15673.62710489271,null,156.73627104892711,null,null,-156.73627104892711,"LOSS",{"$f":"IF(COUNTA($F$6:$F$10)=5,(F328-F24)/F24,\"\")","v":0.55168908338437828},1,"last",null,null,null,null,null,null,null,{"$f":"IF(AND(L327=\"WIN\",L328<>\"WIN\"),SUMIF(L$24:L327,\"WIN\",K$24:K327)-SUM(W$23:W326),\"\")","v":""},{"$f":"IF(AND(L327=\"LOSS\",L328<>\"LOSS\"),SUMIF(L$24:L327,\"LOSS\",K$24:K327)-SUM(X$23:X326),\"\")","v":-156.73627104892876}]
[null,"Row 328 (305)",null,42,null,15516.890833843783,null,155.16890833843783,null,null,186.20269000612538,"WIN",{"$f":"IF(COUNTA($F$6:$F$10)=5,(F329-F24)/F24,\"\")","v":0.57030935238499092},1,"new",null,null,null,null,null,null,null,{"$f":"IF(AND(L328=\"WIN\",L329<>\"WIN\"),SUMIF(L$24:L328,\"WIN\",K$24:K328)-SUM(W$23:W327),\"\")","v":""},{"$f":"IF(AND(L328=\"LOSS\",L329<>\"LOSS\"),SUMIF(L$24:L328,\"LOSS\",K$24:K328)-SUM(X$23:X327),\"\")","v":""}]
[null,"Row 329 (306)",null,45,null,15703.09352384991,null,157.0309352384991,null,null,188.4371222861989,"WIN",{"$f":"IF(COUNTA($F$6:$F$10)=5,(F330-F24)/F24,\"\")","v":0.58915306461361083},2,"last",null,null,null,null,null,null,null,{"$f":"IF(AND(L329=\"WIN\",L330<>\"WIN\"),SUMIF(L$24:L329,\"WIN\",K$24:K329)-SUM(W$23:W328),\"\")","v":374.63981229232377},{"$f":"IF(AND(L329=\"LOSS\",L330<>\"LOSS\"),SUMIF(L$24:L329,\"LOSS\",K$24:K329)-SUM(X$23:X328),\"\")","v":""}]
[null,"Row 330 (307)",null,83,null,15891.530646136109,null,158.9153064613611,null,null,-158.9153064613611,"LOSS",{"$f":"IF(COUNTA($F$6:$F$10)=5,(F331-F24)/F24,\"\")","v":0.5732615339674747},1,"last",null,null,null,null,null,null,null,{"$f":"IF(AND(L330=\"WIN\",L331<>\"WIN\"),SUMIF(L$24:L330,\"WIN\",K$24:K330)-SUM(W$23:W329),\"\")","v":""},{"$f":"IF(AND(L330=\"LOSS\",L331<>\"LOSS\"),SUMIF(L$24:L330,\"LOSS\",K$24:K330)-SUM(X$23:X329),\"\")","v":-158.91530646136016}]
[null,"Row 331 (308)",null,9,null,15732.615339674747,null,157.32615339674746,null,null,188.79138407609693,"WIN",{"$f":"IF(COUNTA($F$6:$F$10)=5,(F332-F24)/F24,\"\")","v":0.59214067237508439},1,"last",null,null,null,null,null,null,null,{"$f":"IF(AND(L331=\"WIN\",L332<>\"WIN\"),SUMIF(L$24:L331,\"WIN\",K$24:K331)-SUM(W$23:W330),\"\")","v":188.79138407609571},{"$f":"IF(AND(L331=\"LOSS\",L332<>\"LOSS\"),SUMIF(L$24:L331,\"LOSS\",K$24:K331)-SUM(X$23:X330),\"\")","v":""}]
[null,"Row 332 (309)",null,87,null,15921.406723750844,null,159.21406723750846,null,null,-159.21406723750846,"LOSS",{"$f":"IF(COUNTA($F$6:$F$10)=5,(F333-F24)/F24,\"\")","v":0.57621926565133363},1,"last",null,null,null,null,null,null,null,{"$f":"IF(AND(L332=\"WIN\",L333<>\"WIN\"),SUMIF(L$24:L332,\"WIN\",K$24:K332)-SUM(W$23:W331),\"\")","v":""},{"$f":"IF(AND(L332=\"LOSS\",L333<>\"LOSS\"),SUMIF(L$24:L332,\"LOSS\",K$24:K332)-SUM(X$23:X331),\"\")","v":-159.21406723750988}]
[null,"Row 333 (310)",null,51,null,15762.192656513336,null,157.62192656513338,null,null,189.14631187816005,"WIN",{"$f":"IF(COUNTA($F$6:$F$10)=5,(F334-F24)/F24,\"\")","v":0.59513389683914952},1,"last",null,null,null,null,null,null,null,{"$f":"IF(AND(L333=\"WIN\",L334<>\"WIN\"),SUMIF(L$24:L333,\"WIN\",K$24:K333)-SUM(W$23:W332),\"\")","v":189.14631187816121},{"$f":"IF(AND(L333=\"LOSS\",L334<>\"LOSS\"),SUMIF(L$24:L333,\"LOSS\",K$24:K333)-SUM(X$23:X332),\"\")","v":""}]
[null,"Row 334 (311)",null,57,null,15951.338968391496,null,159.51338968391497,null,null,-159.51338968391497,"LOSS",{"$f":"IF(COUNTA($F$6:$F$10)=5,(F335-F24)/F24,\"\")","v":0.57918255787075812},1,"last",null,null,null,null,null,null,null,{"$f":"IF(AND(L334=\"WIN\",L335<>\"WIN\"),SUMIF(L$24:L334,\"WIN\",K$24:K334)-SUM(W$23:W333),\"\")","v":""},{"$f":"IF(AND(L334=\"LOSS\",L335<>\"LOSS\"),SUMIF(L$24:L334,\"LOSS\",K$24:K334)-SUM(X$23:X333),\"\")","v":-159.51338968391428}]
[null,"Row 335 (312)",null,19,null,15791.825578707581,null,157.91825578707582,null,null,189.50190694449097,"WIN",{"$f":"IF(COUNTA($F$6:$F$10)=5,(F336-F24)/F24,\"\")","v":0.59813274856520726},1,"new",null,null,null,null,null,null,null,{"$f":"IF(AND(L335=\"WIN\",L336<>\"WIN\"),SUMIF(L$24:L335,\"WIN\",K$24:K335)-SUM(W$23:W334),\"\")","v":""},{"$f":"IF(AND(L335=\"LOSS\",L336<>\"LOSS\"),SUMIF(L$24:L335,\"LOSS\",K$24:K335)-SUM(X$23:X334),\"\")","v":""}]
[null,"Row 336 (313)",null,40,null,15981.327485652073,null,159.81327485652074,null,null,191.77592982782488,"WIN",{"$f":"IF(COUNTA($F$6:$F$10)=5,(F337-F24)/F24,\"\")","v":0.6173103415479898},2,"middle",null,null,null,null,null,null,null,{"$f":"IF(AND(L336=\"WIN\",L337<>\"WIN\"),SUMIF(L$24:L336,\"WIN\",K$24:K336)-SUM(W$23:W335),\"\")","v":""},{"$f":"IF(AND(L336=\"LOSS\",L337<>\"LOSS\"),SUMIF(L$24:L336,\"LOSS\",K$24:K336)-SUM(X$23:X335),\"\")","v":""}]
[null,"Row 337 (314)",null,2,null,16173.103415479898,null,161.73103415479898,null,null,194.07724098575878,"WIN",{"$f":"IF(COUNTA($F$6:$F$10)=5,(F338-F24)/F24,\"\")","v":0.63671806564656563},3,"last",null,null,null,null,null,null,null,{"$f":"IF(AND(L337=\"WIN\",L338<>\"WIN\"),SUMIF(L$24:L337,\"WIN\",K$24:K337)-SUM(W$23:W336),\"\")","v":575.35507775807491},{"$f":"IF(AND(L337=\"LOSS\",L338<>\"LOSS\"),SUMIF(L$24:L337,\"LOSS\",K$24:K337)-SUM(X$23:X336),\"\")","v":""}]
[null,"Row 338 (315)",null,58,null,16367.180656465656,null,163.67180656465658,null,null,-163.67180656465658,"LOSS",{"$f":"IF(COUNTA($F$6:$F$10)=5,(F339-F24)/F24,\"\")","v":0.62035088499009994},1,"last",null,null,null,null,null,null,null,{"$f":"IF(AND(L338=\"WIN\",L339<>\"WIN\"),SUMIF(L$24:L338,\"WIN\",K$24:K338)-SUM(W$23:W337),\"\")","v":""},{"$f":"IF(AND(L338=\"LOSS\",L339<>\"LOSS\"),SUMIF(L$24:L338,\"LOSS\",K$24:K338)-SUM(X$23:X337),\"\")","v":-163.67180656465644}]
[null,"Row 339 (316)",null,29,null,16203.508849901,null,162.03508849901002,null,null,194.44210619881201,"WIN",{"$f":"IF(COUNTA($F$6:$F$10)=5,(F340-F24)/F24,\"\")","v":0.63979509560998127},1,"last",null,null,null,null,null,null,null,{"$f":"IF(AND(L339=\"WIN\",L340<>\"WIN\"),SUMIF(L$24:L339,\"WIN\",K$24:K339)-SUM(W$23:W338),\"\")","v":194.44210619881051},{"$f":"IF(AND(L339=\"LOSS\",L340<>\"LOSS\"),SUMIF(L$24:L339,\"LOSS\",K$24:K339)-SUM(X$23:X338),\"\")","v":""}]
[null,"Row 340 (317)",null,79,null,16397.950956099812,null,163.97950956099814,null,null,-163.97950956099814,"LOSS",{"$f":"IF(COUNTA($F$6:$F$10)=5,(F341-F24)/F24,\"\")","v":0.6233971446538813},1,"last",null,null,null,null,null,null,null,{"$f":"IF(AND(L340=\"WIN\",L341<>\"WIN\"),SUMIF(L$24:L340,\"WIN\",K$24:K340)-SUM(W$23:W339),\"\")","v":""},{"$f":"IF(AND(L340=\"LOSS\",L341<>\"LOSS\"),SUMIF(L$24:L340,\"LOSS\",K$24:K340)-SUM(X$23:X339),\"\")","v":-163.97950956099885}]
[null,"Row 341 (318)",null,52,null,16233.971446538813,null,162.33971446538814,null,null,194.80765735846578,"WIN",{"$f":"IF(COUNTA($F$6:$F$10)=5,(F342-F24)/F24,\"\")","v":0.64287791038972786},1,"new",null,null,null,null,null,null,null,{"$f":"IF(AND(L341=\"WIN\",L342<>\"WIN\"),SUMIF(L$24:L341,\"WIN\",K$24:K341)-SUM(W$23:W340),\"\")","v":""},{"$f":"IF(AND(L341=\"LOSS\",L342<>\"LOSS\"),SUMIF(L$24:L341,\"LOSS\",K$24:K341)-SUM(X$23:X340),\"\")","v":""}]
[null,"Row 342 (319)",null,29,null,16428.779103897279,null,164.28779103897278,null,null,197.14534924676732,"WIN",{"$f":"IF(COUNTA($F$6:$F$10)=5,(F343-F24)/F24,\"\")","v":0.66259244531440453},2,"last",null,null,null,null,null,null,null,{"$f":"IF(AND(L342=\"WIN\",L343<>\"WIN\"),SUMIF(L$24:L342,\"WIN\",K$24:K342)-SUM(W$23:W341),\"\")","v":391.95300660523208},{"$f":"IF(AND(L342=\"LOSS\",L343<>\"LOSS\"),SUMIF(L$24:L342,\"LOSS\",K$24:K342)-SUM(X$23:X341),\"\")","v":""}]
[null,"Row 343 (320)",null,99,null,16625.924453144045,null,166.25924453144046,null,null,-166.25924453144046,"LOSS",{"$f":"IF(COUNTA($F$6:$F$10)=5,(F344-F24)/F24,\"\")","v":0.6459665208612605},1,"new",null,null,null,null,null,null,null,{"$f":"IF(AND(L343=\"WIN\",L344<>\"WIN\"),SUMIF(L$24:L343,\"WIN\",K$24:K343)-SUM(W$23:W342),\"\")","v":""},{"$f":"IF(AND(L343=\"LOSS\",L344<>\"LOSS\"),SUMIF(L$24:L343,\"LOSS\",K$24:K343)-SUM(X$23:X342),\"\")","v":""}]
[null,"Row 344 (321)",null,78,null,16459.665208612605,null,164.59665208612606,null,null,-164.59665208612606,"LOSS",{"$f":"IF(COUNTA($F$6:$F$10)=5,(F345-F24)/F24,\"\")","v":0.62950685565264797},2,"last",null,null,null,null,null,null,null,{"$f":"IF(AND(L344=\"WIN\",L345<>\"WIN\"),SUMIF(L$24:L344,\"WIN\",K$24:K344)-SUM(W$23:W343),\"\")","v":""},{"$f":"IF(AND(L344=\"LOSS\",L345<>\"LOSS\"),SUMIF(L$24:L344,\"LOSS\",K$24:K344)-SUM(X$23:X343),\"\")","v":-330.85589661756603}]
[null,"Row 345 (322)",null,28,null,16295.068556526479,null,{"$f":"IF(COUNTBLANK($F$6:$F$10),\"\",F345*$F$7)","v":162.95068556526479},null,null,195.54082267831774,{"$f":"IF(D345=\"\",\"\",IF(D345<$F$8,\"WIN\",\"LOSS\"))","v":"WIN"},{"$f":"IF(COUNTA($F$6:$F$10)=5,(F346-F24)/F24,\"\")","v":0.64906093792047981},{"$f":"IF(L345=L344,N344+1,1)","v":1},{"$f":"IF(N345=1,IF(N346=1,\"last\",\"new\"),IF(N346=1,\"last\",\"middle\"))","v":"new"},null,null,null,null,null,null,null,{"$f":"IF(AND(L345=\"WIN\",L346<>\"WIN\"),SUMIF(L$24:L345,\"WIN\",K$24:K345)-SUM(W$23:W344),\"\")","v":""},{"$f":"IF(AND(L345=\"LOSS\",L346<>\"LOSS\"),SUMIF(L$24:L345,\"LOSS\",K$24:K345)-SUM(X$23:X344),\"\")","v":""}]
[null,"Row 346 (323)",null,18,null,{"$f":"IF(COUNTBLANK($F$6:$F$10),\"\",IF(D345<$F$8,(1+$F$7*$F$9)*F345-$F$10,(1-$F$7)*F345-$F$10))","v":16490.609379204798},null,164.90609379204798,null,null,{"$f":"IF(COUNTBLANK($F$6:$F$10),\"\", IF(L346=\"win\", H346*$F$9-$F$10, IF(L346=\"loss\", -H346-$F$10)))","v":197.88731255045758},"WIN",{"$f":"IF(COUNTA($F$6:$F$10)=5,(F347-F24)/F24,\"\")","v":0.66884966917552557},2,"middle",null,null,null,null,null,null,null,{"$f":"IF(AND(L346=\"WIN\",L347<>\"WIN\"),SUMIF(L$24:L346,\"WIN\",K$24:K346)-SUM(W$23:W345),\"\")","v":""},{"$f":"IF(AND(L346=\"LOSS\",L347<>\"LOSS\"),SUMIF(L$24:L346,\"LOSS\",K$24:K346)-SUM(X$23:X345),\"\")","v":""}]
[null,"Row 347 (324)",null,4,null,16688.496691755256,null,166.88496691755256,null,null,200.26196030106306,"WIN",{"$f":"IF(COUNTA($F$6:$F$10)=5,(F348-F24)/F24,\"\")","v":0.68887586520563204},3,"last",null,null,null,null,null,null,null,{"$f":"IF(AND(L347=\"WIN\",L348<>\"WIN\"),SUMIF(L$24:L347,\"WIN\",K$24:K347)-SUM(W$23:W346),\"\")","v":593.69009552984062},{"$f":"IF(AND(L347=\"LOSS\",L348<>\"LOSS\"),SUMIF(L$24:L347,\"LOSS\",K$24:K347)-SUM(X$23:X346),\"\")","v":""}]
[null,"Row 348 (325)",null,86,null,16888.75865205632,null,168.88758652056319,null,null,-168.88758652056319,"LOSS",{"$f":"IF(COUNTA($F$6:$F$10)=5,(F349-F24)/F24,\"\")","v":0.67198710655357574},1,"last",null,null,null,null,null,null,null,{"$f":"IF(AND(L348=\"WIN\",L349<>\"WIN\"),SUMIF(L$24:L348,\"WIN\",K$24:K348)-SUM(W$23:W347),\"\")","v":""},{"$f":"IF(AND(L348=\"LOSS\",L349<>\"LOSS\"),SUMIF(L$24:L348,\"LOSS\",K$24:K348)-SUM(X$23:X347),\"\")","v":-168.88758652056276}]
[null,"Row 349 (326)",null,12,null,16719.871065535757,null,167.19871065535759,null,null,200.6384527864291,"WIN",{"$f":"IF(COUNTA($F$6:$F$10)=5,(F350-F24)/F24,\"\")","v":0.69205095183221854},1,"new",null,null,null,null,null,null,null,{"$f":"IF(AND(L349=\"WIN\",L350<>\"WIN\"),SUMIF(L$24:L349,\"WIN\",K$24:K349)-SUM(W$23:W348),\"\")","v":""},{"$f":"IF(AND(L349=\"LOSS\",L350<>\"LOSS\"),SUMIF(L$24:L349,\"LOSS\",K$24:K349)-SUM(X$23:X348),\"\")","v":""}]
[null,"Row 350 (327)",null,21,null,16920.509518322186,null,169.20509518322186,null,null,203.04611421986621,"WIN",{"$f":"IF(COUNTA($F$6:$F$10)=5,(F351-F24)/F24,\"\")","v":0.71235556325420513},2,"middle",null,null,null,null,null,null,null,{"$f":"IF(AND(L350=\"WIN\",L351<>\"WIN\"),SUMIF(L$24:L350,\"WIN\",K$24:K350)-SUM(W$23:W349),\"\")","v":""},{"$f":"IF(AND(L350=\"LOSS\",L351<>\"LOSS\"),SUMIF(L$24:L350,\"LOSS\",K$24:K350)-SUM(X$23:X349),\"\")","v":""}]
[null,"Row 351 (328)",null,5,null,17123.555632542051,null,171.2355563254205,null,null,205.4826675905046,"WIN",{"$f":"IF(COUNTA($F$6:$F$10)=5,(F352-F24)/F24,\"\")","v":0.73290383001325576},3,"last",null,null,null,null,null,null,null,{"$f":"IF(AND(L351=\"WIN\",L352<>\"WIN\"),SUMIF(L$24:L351,\"WIN\",K$24:K351)-SUM(W$23:W350),\"\")","v":609.16723459679997},{"$f":"IF(AND(L351=\"LOSS\",L352<>\"LOSS\"),SUMIF(L$24:L351,\"LOSS\",K$24:K351)-SUM(X$23:X350),\"\")","v":""}]
[null,"Row 352 (329)",null,83,null,17329.038300132557,null,173.29038300132558,null,null,-173.29038300132558,"LOSS",{"$f":"IF(COUNTA($F$6:$F$10)=5,(F353-F24)/F24,\"\")","v":0.71557479171312299},1,"new",null,null,null,null,null,null,null,{"$f":"IF(AND(L352=\"WIN\",L353<>\"WIN\"),SUMIF(L$24:L352,\"WIN\",K$24:K352)-SUM(W$23:W351),\"\")","v":""},{"$f":"IF(AND(L352=\"LOSS\",L353<>\"LOSS\"),SUMIF(L$24:L352,\"LOSS\",K$24:K352)-SUM(X$23:X351),\"\")","v":""}]
[null,"Row 353 (330)",null,90,null,17155.74791713123,null,171.55747917131231,null,null,-171.55747917131231,"LOSS",{"$f":"IF(COUNTA($F$6:$F$10)=5,(F354-F24)/F24,\"\")","v":0.69841904379599185},2,"middle",null,null,null,null,null,null,null,{"$f":"IF(AND(L353=\"WIN\",L354<>\"WIN\"),SUMIF(L$24:L353,\"WIN\",K$24:K353)-SUM(W$23:W352),\"\")","v":""},{"$f":"IF(AND(L353=\"LOSS\",L354<>\"LOSS\"),SUMIF(L$24:L353,\"LOSS\",K$24:K353)-SUM(X$23:X352),\"\")","v":""}]
[null,"Row 354 (331)",null,98,null,16984.190437959918,null,169.84190437959919,null,null,-169.84190437959919,"LOSS",{"$f":"IF(COUNTA($F$6:$F$10)=5,(F355-F24)/F24,\"\")","v":0.681434853358032},3,"last",null,null,null,null,null,null,null,{"$f":"IF(AND(L354=\"WIN\",L355<>\"WIN\"),SUMIF(L$24:L354,\"WIN\",K$24:K354)-SUM(W$23:W353),\"\")","v":""},{"$f":"IF(AND(L354=\"LOSS\",L355<>\"LOSS\"),SUMIF(L$24:L354,\"LOSS\",K$24:K354)-SUM(X$23:X353),\"\")","v":-514.68976655223378}]
[null,"Row 355 (332)",null,54,null,16814.34853358032,null,168.14348533580321,null,null,201.77218240296384,"WIN",{"$f":"IF(COUNTA($F$6:$F$10)=5,(F356-F24)/F24,\"\")","v":0.7016120715983285},1,"new",null,null,null,null,null,null,null,{"$f":"IF(AND(L355=\"WIN\",L356<>\"WIN\"),SUMIF(L$24:L355,\"WIN\",K$24:K355)-SUM(W$23:W354),\"\")","v":""},{"$f":"IF(AND(L355=\"LOSS\",L356<>\"LOSS\"),SUMIF(L$24:L355,\"LOSS\",K$24:K355)-SUM(X$23:X354),\"\")","v":""}]
[null,"Row 356 (333)",null,26,null,17016.120715983285,null,170.16120715983286,null,null,204.19344859179941,"WIN",{"$f":"IF(COUNTA($F$6:$F$10)=5,(F357-F24)/F24,\"\")","v":0.72203141645750835},2,"middle",null,null,null,null,null,null,null,{"$f":"IF(AND(L356=\"WIN\",L357<>\"WIN\"),SUMIF(L$24:L356,\"WIN\",K$24:K356)-SUM(W$23:W355),\"\")","v":""},{"$f":"IF(AND(L356=\"LOSS\",L357<>\"LOSS\"),SUMIF(L$24:L356,\"LOSS\",K$24:K356)-SUM(X$23:X355),\"\")","v":""}]
[null,"Row 357 (334)",null,24,null,17220.314164575084,null,172.20314164575083,null,null,206.64376997490101,"WIN",{"$f":"IF(COUNTA($F$6:$F$10)=5,(F358-F24)/F24,\"\")","v":0.74269579345499837},3,"last",null,null,null,null,null,null,null,{"$f":"IF(AND(L357=\"WIN\",L358<>\"WIN\"),SUMIF(L$24:L357,\"WIN\",K$24:K357)-SUM(W$23:W356),\"\")","v":612.60940096966442},{"$f":"IF(AND(L357=\"LOSS\",L358<>\"LOSS\"),SUMIF(L$24:L357,\"LOSS\",K$24:K357)-SUM(X$23:X356),\"\")","v":""}]
[null,"Row 358 (335)",null,62,null,17426.957934549984,null,174.26957934549984,null,null,-174.26957934549984,"LOSS",{"$f":"IF(COUNTA($F$6:$F$10)=5,(F359-F24)/F24,\"\")","v":0.72526883552044852},1,"last",null,null,null,null,null,null,null,{"$f":"IF(AND(L358=\"WIN\",L359<>\"WIN\"),SUMIF(L$24:L358,\"WIN\",K$24:K358)-SUM(W$23:W357),\"\")","v":""},{"$f":"IF(AND(L358=\"LOSS\",L359<>\"LOSS\"),SUMIF(L$24:L358,\"LOSS\",K$24:K358)-SUM(X$23:X357),\"\")","v":-174.26957934549864}]
[null,"Row 359 (336)",null,6,null,17252.688355204486,null,172.52688355204486,null,null,207.03226026245383,"WIN",{"$f":"IF(COUNTA($F$6:$F$10)=5,(F360-F24)/F24,\"\")","v":0.74597206154669404},1,"new",null,null,null,null,null,null,null,{"$f":"IF(AND(L359=\"WIN\",L360<>\"WIN\"),SUMIF(L$24:L359,\"WIN\",K$24:K359)-SUM(W$23:W358),\"\")","v":""},{"$f":"IF(AND(L359=\"LOSS\",L360<>\"LOSS\"),SUMIF(L$24:L359,\"LOSS\",K$24:K359)-SUM(X$23:X358),\"\")","v":""}]
[null,"Row 360 (337)",null,2,null,17459.72061546694,null,174.59720615466941,null,null,209.51664738560328,"WIN",{"$f":"IF(COUNTA($F$6:$F$10)=5,(F361-F24)/F24,\"\")","v":0.7669237262852544},2,"middle",null,null,null,null,null,null,null,{"$f":"IF(AND(L360=\"WIN\",L361<>\"WIN\"),SUMIF(L$24:L360,\"WIN\",K$24:K360)-SUM(W$23:W359),\"\")","v":""},{"$f":"IF(AND(L360=\"LOSS\",L361<>\"LOSS\"),SUMIF(L$24:L360,\"LOSS\",K$24:K360)-SUM(X$23:X359),\"\")","v":""}]
[null,"Row 361 (338)",null,33,null,17669.237262852545,null,176.69237262852545,null,null,212.03084715423054,"WIN",{"$f":"IF(COUNTA($F$6:$F$10)=5,(F362-F24)/F24,\"\")","v":0.7881268110006775},3,"last",null,null,null,null,null,null,null,{"$f":"IF(AND(L361=\"WIN\",L362<>\"WIN\"),SUMIF(L$24:L361,\"WIN\",K$24:K361)-SUM(W$23:W360),\"\")","v":628.57975480228924},{"$f":"IF(AND(L361=\"LOSS\",L362<>\"LOSS\"),SUMIF(L$24:L361,\"LOSS\",K$24:K361)-SUM(X$23:X360),\"\")","v":""}]
[null,"Row 362 (339)",null,71,null,17881.268110006775,null,178.81268110006775,null,null,-178.81268110006775,"LOSS",{"$f":"IF(COUNTA($F$6:$F$10)=5,(F363-F24)/F24,\"\")","v":0.7702455428906706},1,"last",null,null,null,null,null,null,null,{"$f":"IF(AND(L362=\"WIN\",L363<>\"WIN\"),SUMIF(L$24:L362,\"WIN\",K$24:K362)-SUM(W$23:W361),\"\")","v":""},{"$f":"IF(AND(L362=\"LOSS\",L363<>\"LOSS\"),SUMIF(L$24:L362,\"LOSS\",K$24:K362)-SUM(X$23:X361),\"\")","v":-178.81268110006931}]
[null,"Row 363 (340)",null,35,null,17702.455428906705,null,177.02455428906705,null,null,212.42946514688046,"WIN",{"$f":"IF(COUNTA($F$6:$F$10)=5,(F364-F24)/F24,\"\")","v":0.79148848940535865},1,"last",null,null,null,null,null,null,null,{"$f":"IF(AND(L363=\"WIN\",L364<>\"WIN\"),SUMIF(L$24:L363,\"WIN\",K$24:K363)-SUM(W$23:W362),\"\")","v":212.42946514688083},{"$f":"IF(AND(L363=\"LOSS\",L364<>\"LOSS\"),SUMIF(L$24:L363,\"LOSS\",K$24:K363)-SUM(X$23:X362),\"\")","v":""}]
[null,"Row 364 (341)",null,75,null,17914.884894053586,null,179.14884894053586,null,null,-179.14884894053586,"LOSS",{"$f":"IF(COUNTA($F$6:$F$10)=5,(F365-F24)/F24,\"\")","v":0.77357360451130519},1,"new",null,null,null,null,null,null,null,{"$f":"IF(AND(L364=\"WIN\",L365<>\"WIN\"),SUMIF(L$24:L364,\"WIN\",K$24:K364)-SUM(W$23:W363),\"\")","v":""},{"$f":"IF(AND(L364=\"LOSS\",L365<>\"LOSS\"),SUMIF(L$24:L364,\"LOSS\",K$24:K364)-SUM(X$23:X363),\"\")","v":""}]
[null,"Row 365 (342)",null,65,null,17735.736045113052,null,177.35736045113052,null,null,-177.35736045113052,"LOSS",{"$f":"IF(COUNTA($F$6:$F$10)=5,(F366-F24)/F24,\"\")","v":0.75583786846619228},2,"middle",null,null,null,null,null,null,null,{"$f":"IF(AND(L365=\"WIN\",L366<>\"WIN\"),SUMIF(L$24:L365,\"WIN\",K$24:K365)-SUM(W$23:W364),\"\")","v":""},{"$f":"IF(AND(L365=\"LOSS\",L366<>\"LOSS\"),SUMIF(L$24:L365,\"LOSS\",K$24:K365)-SUM(X$23:X364),\"\")","v":""}]
[null,"Row 366 (343)",null,56,null,17558.378684661922,null,175.58378684661923,null,null,-175.58378684661923,"LOSS",{"$f":"IF(COUNTA($F$6:$F$10)=5,(F367-F24)/F24,\"\")","v":0.73827948978153035},3,"middle",null,null,null,null,null,null,null,{"$f":"IF(AND(L366=\"WIN\",L367<>\"WIN\"),SUMIF(L$24:L366,\"WIN\",K$24:K366)-SUM(W$23:W365),\"\")","v":""},{"$f":"IF(AND(L366=\"LOSS\",L367<>\"LOSS\"),SUMIF(L$24:L366,\"LOSS\",K$24:K366)-SUM(X$23:X365),\"\")","v":""}]
[null,"Row 367 (344)",null,95,null,17382.794897815304,null,173.82794897815305,null,null,-173.82794897815305,"LOSS",{"$f":"IF(COUNTA($F$6:$F$10)=5,(F368-F24)/F24,\"\")","v":0.72089669488371511},4,"last",null,null,null,null,null,null,null,{"$f":"IF(AND(L367=\"WIN\",L368<>\"WIN\"),SUMIF(L$24:L367,\"WIN\",K$24:K367)-SUM(W$23:W366),\"\")","v":""},{"$f":"IF(AND(L367=\"LOSS\",L368<>\"LOSS\"),SUMIF(L$24:L367,\"LOSS\",K$24:K367)-SUM(X$23:X366),\"\")","v":-705.91794521643533}]
[null,"Row 368 (345)",null,35,null,17208.966948837151,null,172.08966948837153,null,null,206.50760338604582,"WIN",{"$f":"IF(COUNTA($F$6:$F$10)=5,(F369-F24)/F24,\"\")","v":0.74154745522231968},1,"new",null,null,null,null,null,null,null,{"$f":"IF(AND(L368=\"WIN\",L369<>\"WIN\"),SUMIF(L$24:L368,\"WIN\",K$24:K368)-SUM(W$23:W367),\"\")","v":""},{"$f":"IF(AND(L368=\"LOSS\",L369<>\"LOSS\"),SUMIF(L$24:L368,\"LOSS\",K$24:K368)-SUM(X$23:X367),\"\")","v":""}]
[null,"Row 369 (346)",null,47,null,17415.474552223197,null,174.15474552223196,null,null,208.98569462667834,"WIN",{"$f":"IF(COUNTA($F$6:$F$10)=5,(F370-F24)/F24,\"\")","v":0.76244602468498746},2,"last",null,null,null,null,null,null,null,{"$f":"IF(AND(L369=\"WIN\",L370<>\"WIN\"),SUMIF(L$24:L369,\"WIN\",K$24:K369)-SUM(W$23:W368),\"\")","v":415.49329801272324},{"$f":"IF(AND(L369=\"LOSS\",L370<>\"LOSS\"),SUMIF(L$24:L369,\"LOSS\",K$24:K369)-SUM(X$23:X368),\"\")","v":""}]
[null,"Row 370 (347)",null,91,null,17624.460246849874,null,176.24460246849875,null,null,-176.24460246849875,"LOSS",{"$f":"IF(COUNTA($F$6:$F$10)=5,(F371-F24)/F24,\"\")","v":0.74482156443813763},1,"last",null,null,null,null,null,null,null,{"$f":"IF(AND(L370=\"WIN\",L371<>\"WIN\"),SUMIF(L$24:L370,\"WIN\",K$24:K370)-SUM(W$23:W369),\"\")","v":""},{"$f":"IF(AND(L370=\"LOSS\",L371<>\"LOSS\"),SUMIF(L$24:L370,\"LOSS\",K$24:K370)-SUM(X$23:X369),\"\")","v":-176.24460246849776}]
[null,"Row 371 (348)",null,17,null,17448.215644381376,null,174.48215644381378,null,null,209.37858773257653,"WIN",{"$f":"IF(COUNTA($F$6:$F$10)=5,(F372-F24)/F24,\"\")","v":0.76575942321139523},1,"last",null,null,null,null,null,null,null,{"$f":"IF(AND(L371=\"WIN\",L372<>\"WIN\"),SUMIF(L$24:L371,\"WIN\",K$24:K371)-SUM(W$23:W370),\"\")","v":209.3785877325754},{"$f":"IF(AND(L371=\"LOSS\",L372<>\"LOSS\"),SUMIF(L$24:L371,\"LOSS\",K$24:K371)-SUM(X$23:X370),\"\")","v":""}]
[null,"Row 372 (349)",null,82,null,17657.594232113952,null,176.57594232113954,null,null,-176.57594232113954,"LOSS",{"$f":"IF(COUNTA($F$6:$F$10)=5,(F373-F24)/F24,\"\")","v":0.74810182897928135},1,"last",null,null,null,null,null,null,null,{"$f":"IF(AND(L372=\"WIN\",L373<>\"WIN\"),SUMIF(L$24:L372,\"WIN\",K$24:K372)-SUM(W$23:W371),\"\")","v":""},{"$f":"IF(AND(L372=\"LOSS\",L373<>\"LOSS\"),SUMIF(L$24:L372,\"LOSS\",K$24:K372)-SUM(X$23:X371),\"\")","v":-176.57594232113843}]
[null,"Row 373 (350)",null,17,null,17481.018289792813,null,174.81018289792814,null,null,209.77221947751377,"WIN",{"$f":"IF(COUNTA($F$6:$F$10)=5,(F374-F24)/F24,\"\")","v":0.76907905092703255},1,"last",null,null,null,null,null,null,null,{"$f":"IF(AND(L373=\"WIN\",L374<>\"WIN\"),SUMIF(L$24:L373,\"WIN\",K$24:K373)-SUM(W$23:W372),\"\")","v":209.77221947751241},{"$f":"IF(AND(L373=\"LOSS\",L374<>\"LOSS\"),SUMIF(L$24:L373,\"LOSS\",K$24:K373)-SUM(X$23:X372),\"\")","v":""}]
[null,"Row 374 (351)",null,90,null,17690.790509270326,null,176.90790509270326,null,null,-176.90790509270326,"LOSS",{"$f":"IF(COUNTA($F$6:$F$10)=5,(F375-F24)/F24,\"\")","v":0.7513882604177623},1,"new",null,null,null,null,null,null,null,{"$f":"IF(AND(L374=\"WIN\",L375<>\"WIN\"),SUMIF(L$24:L374,\"WIN\",K$24:K374)-SUM(W$23:W373),\"\")","v":""},{"$f":"IF(AND(L374=\"LOSS\",L375<>\"LOSS\"),SUMIF(L$24:L374,\"LOSS\",K$24:K374)-SUM(X$23:X373),\"\")","v":""}]
[null,"Row 375 (352)",null,77,null,17513.882604177623,null,175.13882604177624,null,null,-175.13882604177624,"LOSS",{"$f":"IF(COUNTA($F$6:$F$10)=5,(F376-F24)/F24,\"\")","v":0.73387437781358456},2,"middle",null,null,null,null,null,null,null,{"$f":"IF(AND(L375=\"WIN\",L376<>\"WIN\"),SUMIF(L$24:L375,\"WIN\",K$24:K375)-SUM(W$23:W374),\"\")","v":""},{"$f":"IF(AND(L375=\"LOSS\",L376<>\"LOSS\"),SUMIF(L$24:L375,\"LOSS\",K$24:K375)-SUM(X$23:X374),\"\")","v":""}]
[null,"Row 376 (353)",null,96,null,17338.743778135846,null,173.38743778135847,null,null,-173.38743778135847,"LOSS",{"$f":"IF(COUNTA($F$6:$F$10)=5,(F377-F24)/F24,\"\")","v":0.71653563403544862},3,"last",null,null,null,null,null,null,null,{"$f":"IF(AND(L376=\"WIN\",L377<>\"WIN\"),SUMIF(L$24:L376,\"WIN\",K$24:K376)-SUM(W$23:W375),\"\")","v":""},{"$f":"IF(AND(L376=\"LOSS\",L377<>\"LOSS\"),SUMIF(L$24:L376,\"LOSS\",K$24:K376)-SUM(X$23:X375),\"\")","v":-525.43416891583911}]
[null,"Row 377 (354)",null,9,null,17165.356340354487,null,171.65356340354487,null,null,205.98427608425382,"WIN",{"$f":"IF(COUNTA($F$6:$F$10)=5,(F378-F24)/F24,\"\")","v":0.73713406164387418},1,"last",null,null,null,null,null,null,null,{"$f":"IF(AND(L377=\"WIN\",L378<>\"WIN\"),SUMIF(L$24:L377,\"WIN\",K$24:K377)-SUM(W$23:W376),\"\")","v":205.98427608425482},{"$f":"IF(AND(L377=\"LOSS\",L378<>\"LOSS\"),SUMIF(L$24:L377,\"LOSS\",K$24:K377)-SUM(X$23:X376),\"\")","v":""}]
[null,"Row 378 (355)",null,87,null,17371.340616438742,null,173.71340616438741,null,null,-173.71340616438741,"LOSS",{"$f":"IF(COUNTA($F$6:$F$10)=5,(F379-F24)/F24,\"\")","v":0.71976272102743533},1,"new",null,null,null,null,null,null,null,{"$f":"IF(AND(L378=\"WIN\",L379<>\"WIN\"),SUMIF(L$24:L378,\"WIN\",K$24:K378)-SUM(W$23:W377),\"\")","v":""},{"$f":"IF(AND(L378=\"LOSS\",L379<>\"LOSS\"),SUMIF(L$24:L378,\"LOSS\",K$24:K378)-SUM(X$23:X377),\"\")","v":""}]
[null,"Row 379 (356)",null,96,null,17197.627210274353,null,171.97627210274354,null,null,-171.97627210274354,"LOSS",{"$f":"IF(COUNTA($F$6:$F$10)=5,(F380-F24)/F24,\"\")","v":0.70256509381716092},2,"last",null,null,null,null,null,null,null,{"$f":"IF(AND(L379=\"WIN\",L380<>\"WIN\"),SUMIF(L$24:L379,\"WIN\",K$24:K379)-SUM(W$23:W378),\"\")","v":""},{"$f":"IF(AND(L379=\"LOSS\",L380<>\"LOSS\"),SUMIF(L$24:L379,\"LOSS\",K$24:K379)-SUM(X$23:X378),\"\")","v":-345.68967826713197}]
[null,"Row 380 (357)",null,39,null,17025.65093817161,null,170.25650938171609,null,null,204.3078112580593,"WIN",{"$f":"IF(COUNTA($F$6:$F$10)=5,(F381-F24)/F24,\"\")","v":0.7229958749429668},1,"new",null,null,null,null,null,null,null,{"$f":"IF(AND(L380=\"WIN\",L381<>\"WIN\"),SUMIF(L$24:L380,\"WIN\",K$24:K380)-SUM(W$23:W379),\"\")","v":""},{"$f":"IF(AND(L380=\"LOSS\",L381<>\"LOSS\"),SUMIF(L$24:L380,\"LOSS\",K$24:K380)-SUM(X$23:X379),\"\")","v":""}]
[null,"Row 381 (358)",null,18,null,17229.958749429668,null,172.29958749429667,null,null,206.75950499315601,"WIN",{"$f":"IF(COUNTA($F$6:$F$10)=5,(F382-F24)/F24,\"\")","v":0.74367182544228239},2,"middle",null,null,null,null,null,null,null,{"$f":"IF(AND(L381=\"WIN\",L382<>\"WIN\"),SUMIF(L$24:L381,\"WIN\",K$24:K381)-SUM(W$23:W380),\"\")","v":""},{"$f":"IF(AND(L381=\"LOSS\",L382<>\"LOSS\"),SUMIF(L$24:L381,\"LOSS\",K$24:K381)-SUM(X$23:X380),\"\")","v":""}]
[null,"Row 382 (359)",null,51,null,17436.718254422824,null,174.36718254422823,null,null,209.24061905307386,"WIN",{"$f":"IF(COUNTA($F$6:$F$10)=5,(F383-F24)/F24,\"\")","v":0.76459588734758976},3,"middle",null,null,null,null,null,null,null,{"$f":"IF(AND(L382=\"WIN\",L383<>\"WIN\"),SUMIF(L$24:L382,\"WIN\",K$24:K382)-SUM(W$23:W381),\"\")","v":""},{"$f":"IF(AND(L382=\"LOSS\",L383<>\"LOSS\"),SUMIF(L$24:L382,\"LOSS\",K$24:K382)-SUM(X$23:X381),\"\")","v":""}]
[null,"Row 383 (360)",null,53,null,17645.958873475898,null,176.459588734759,null,null,211.75150648171078,"WIN",{"$f":"IF(COUNTA($F$6:$F$10)=5,(F384-F24)/F24,\"\")","v":0.78577103799576109},4,"middle",null,null,null,null,null,null,null,{"$f":"IF(AND(L383=\"WIN\",L384<>\"WIN\"),SUMIF(L$24:L383,\"WIN\",K$24:K383)-SUM(W$23:W382),\"\")","v":""},{"$f":"IF(AND(L383=\"LOSS\",L384<>\"LOSS\"),SUMIF(L$24:L383,\"LOSS\",K$24:K383)-SUM(X$23:X382),\"\")","v":""}]
[null,"Row 384 (361)",null,42,null,17857.710379957611,null,178.57710379957612,null,null,214.29252455949134,"WIN",{"$f":"IF(COUNTA($F$6:$F$10)=5,(F385-F24)/F24,\"\")","v":0.80720029045171027},5,"middle",null,null,null,null,null,null,null,{"$f":"IF(AND(L384=\"WIN\",L385<>\"WIN\"),SUMIF(L$24:L384,\"WIN\",K$24:K384)-SUM(W$23:W383),\"\")","v":""},{"$f":"IF(AND(L384=\"LOSS\",L385<>\"LOSS\"),SUMIF(L$24:L384,\"LOSS\",K$24:K384)-SUM(X$23:X383),\"\")","v":""}]
[null,"Row 385 (362)",null,2,null,18072.002904517103,null,180.72002904517103,null,null,216.86403485420524,"WIN",{"$f":"IF(COUNTA($F$6:$F$10)=5,(F386-F24)/F24,\"\")","v":0.82888669393713099},6,"middle",null,null,null,null,null,null,null,{"$f":"IF(AND(L385=\"WIN\",L386<>\"WIN\"),SUMIF(L$24:L385,\"WIN\",K$24:K385)-SUM(W$23:W384),\"\")","v":""},{"$f":"IF(AND(L385=\"LOSS\",L386<>\"LOSS\"),SUMIF(L$24:L385,\"LOSS\",K$24:K385)-SUM(X$23:X384),\"\")","v":""}]
[null,"Row 386 (363)",null,33,null,18288.86693937131,null,182.88866939371312,null,null,219.46640327245572,"WIN",{"$f":"IF(COUNTA($F$6:$F$10)=5,(F387-F24)/F24,\"\")","v":0.85083333426437679},7,"last",null,null,null,null,null,null,null,{"$f":"IF(AND(L386=\"WIN\",L387<>\"WIN\"),SUMIF(L$24:L386,\"WIN\",K$24:K386)-SUM(W$23:W385),\"\")","v":1482.6824044721543},{"$f":"IF(AND(L386=\"LOSS\",L387<>\"LOSS\"),SUMIF(L$24:L386,\"LOSS\",K$24:K386)-SUM(X$23:X385),\"\")","v":""}]
[null,"Row 387 (364)",null,57,null,18508.333342643768,null,185.08333342643769,null,null,-185.08333342643769,"LOSS",{"$f":"IF(COUNTA($F$6:$F$10)=5,(F388-F24)/F24,\"\")","v":0.83232500092173289},1,"new",null,null,null,null,null,null,null,{"$f":"IF(AND(L387=\"WIN\",L388<>\"WIN\"),SUMIF(L$24:L387,\"WIN\",K$24:K387)-SUM(W$23:W386),\"\")","v":""},{"$f":"IF(AND(L387=\"LOSS\",L388<>\"LOSS\"),SUMIF(L$24:L387,\"LOSS\",K$24:K387)-SUM(X$23:X386),\"\")","v":""}]
[null,"Row 388 (365)",null,70,null,18323.250009217329,null,183.2325000921733,null,null,-183.2325000921733,"LOSS",{"$f":"IF(COUNTA($F$6:$F$10)=5,(F389-F24)/F24,\"\")","v":0.81400175091251548},2,"middle",null,null,null,null,null,null,null,{"$f":"IF(AND(L388=\"WIN\",L389<>\"WIN\"),SUMIF(L$24:L388,\"WIN\",K$24:K388)-SUM(W$23:W387),\"\")","v":""},{"$f":"IF(AND(L388=\"LOSS\",L389<>\"LOSS\"),SUMIF(L$24:L388,\"LOSS\",K$24:K388)-SUM(X$23:X387),\"\")","v":""}]
[null,"Row 389 (366)",null,93,null,18140.017509125155,null,181.40017509125155,null,null,-181.40017509125155,"LOSS",{"$f":"IF(COUNTA($F$6:$F$10)=5,(F390-F24)/F24,\"\")","v":0.7958617334033905},3,"last",null,null,null,null,null,null,null,{"$f":"IF(AND(L389=\"WIN\",L390<>\"WIN\"),SUMIF(L$24:L389,\"WIN\",K$24:K389)-SUM(W$23:W388),\"\")","v":""},{"$f":"IF(AND(L389=\"LOSS\",L390<>\"LOSS\"),SUMIF(L$24:L389,\"LOSS\",K$24:K389)-SUM(X$23:X388),\"\")","v":-549.71600860986291}]
[null,"Row 390 (367)",null,1,null,17958.617334033905,null,179.58617334033906,null,null,215.50340800840686,"WIN",{"$f":"IF(COUNTA($F$6:$F$10)=5,(F391-F24)/F24,\"\")","v":0.81741207420423123},1,"last",null,null,null,null,null,null,null,{"$f":"IF(AND(L390=\"WIN\",L391<>\"WIN\"),SUMIF(L$24:L390,\"WIN\",K$24:K390)-SUM(W$23:W389),\"\")","v":215.50340800840786},{"$f":"IF(AND(L390=\"LOSS\",L391<>\"LOSS\"),SUMIF(L$24:L390,\"LOSS\",K$24:K390)-SUM(X$23:X389),\"\")","v":""}]
[null,"Row 391 (368)",null,91,null,18174.120742042312,null,181.74120742042314,null,null,-181.74120742042314,"LOSS",{"$f":"IF(COUNTA($F$6:$F$10)=5,(F392-F24)/F24,\"\")","v":0.79923795346218907},1,"new",null,null,null,null,null,null,null,{"$f":"IF(AND(L391=\"WIN\",L392<>\"WIN\"),SUMIF(L$24:L391,\"WIN\",K$24:K391)-SUM(W$23:W390),\"\")","v":""},{"$f":"IF(AND(L391=\"LOSS\",L392<>\"LOSS\"),SUMIF(L$24:L391,\"LOSS\",K$24:K391)-SUM(X$23:X390),\"\")","v":""}]
[null,"Row 392 (369)",null,72,null,17992.37953462189,null,179.9237953462189,null,null,-179.9237953462189,"LOSS",{"$f":"IF(COUNTA($F$6:$F$10)=5,(F393-F24)/F24,\"\")","v":0.78124557392756722},2,"middle",null,null,null,null,null,null,null,{"$f":"IF(AND(L392=\"WIN\",L393<>\"WIN\"),SUMIF(L$24:L392,\"WIN\",K$24:K392)-SUM(W$23:W391),\"\")","v":""},{"$f":"IF(AND(L392=\"LOSS\",L393<>\"LOSS\"),SUMIF(L$24:L392,\"LOSS\",K$24:K392)-SUM(X$23:X391),\"\")","v":""}]
[null,"Row 393 (370)",null,84,null,17812.455739275672,null,178.12455739275671,null,null,-178.12455739275671,"LOSS",{"$f":"IF(COUNTA($F$6:$F$10)=5,(F394-F24)/F24,\"\")","v":0.76343311818829174},3,"last",null,null,null,null,null,null,null,{"$f":"IF(AND(L393=\"WIN\",L394<>\"WIN\"),SUMIF(L$24:L393,\"WIN\",K$24:K393)-SUM(W$23:W392),\"\")","v":""},{"$f":"IF(AND(L393=\"LOSS\",L394<>\"LOSS\"),SUMIF(L$24:L393,\"LOSS\",K$24:K393)-SUM(X$23:X392),\"\")","v":-539.78956015939548}]
[null,"Row 394 (371)",null,43,null,17634.331181882917,null,176.34331181882916,null,null,211.61197418259499,"WIN",{"$f":"IF(COUNTA($F$6:$F$10)=5,(F395-F24)/F24,\"\")","v":0.78459431560655135},1,"new",null,null,null,null,null,null,null,{"$f":"IF(AND(L394=\"WIN\",L395<>\"WIN\"),SUMIF(L$24:L394,\"WIN\",K$24:K394)-SUM(W$23:W393),\"\")","v":""},{"$f":"IF(AND(L394=\"LOSS\",L395<>\"LOSS\"),SUMIF(L$24:L394,\"LOSS\",K$24:K394)-SUM(X$23:X393),\"\")","v":""}]
[null,"Row 395 (372)",null,4,null,17845.943156065514,null,178.45943156065513,null,null,214.15131787278617,"WIN",{"$f":"IF(COUNTA($F$6:$F$10)=5,(F396-F24)/F24,\"\")","v":0.80600944739383007},2,"middle",null,null,null,null,null,null,null,{"$f":"IF(AND(L395=\"WIN\",L396<>\"WIN\"),SUMIF(L$24:L395,\"WIN\",K$24:K395)-SUM(W$23:W394),\"\")","v":""},{"$f":"IF(AND(L395=\"LOSS\",L396<>\"LOSS\"),SUMIF(L$24:L395,\"LOSS\",K$24:K395)-SUM(X$23:X394),\"\")","v":""}]
[null,"Row 396 (373)",null,48,null,18060.094473938301,null,180.60094473938301,null,null,216.7211336872596,"WIN",{"$f":"IF(COUNTA($F$6:$F$10)=5,(F397-F24)/F24,\"\")","v":0.82768156076255617},3,"middle",null,null,null,null,null,null,null,{"$f":"IF(AND(L396=\"WIN\",L397<>\"WIN\"),SUMIF(L$24:L396,\"WIN\",K$24:K396)-SUM(W$23:W395),\"\")","v":""},{"$f":"IF(AND(L396=\"LOSS\",L397<>\"LOSS\"),SUMIF(L$24:L396,\"LOSS\",K$24:K396)-SUM(X$23:X395),\"\")","v":""}]
[null,"Row 397 (374)",null,42,null,18276.815607625562,null,182.76815607625562,null,null,219.32178729150675,"WIN",{"$f":"IF(COUNTA($F$6:$F$10)=5,(F398-F24)/F24,\"\")","v":0.84961373949170704},4,"last",null,null,null,null,null,null,null,{"$f":"IF(AND(L397=\"WIN\",L398<>\"WIN\"),SUMIF(L$24:L397,\"WIN\",K$24:K397)-SUM(W$23:W396),\"\")","v":861.80621303414591},{"$f":"IF(AND(L397=\"LOSS\",L398<>\"LOSS\"),SUMIF(L$24:L397,\"LOSS\",K$24:K397)-SUM(X$23:X396),\"\")","v":""}]
[null,"Row 398 (375)",null,92,null,18496.13739491707,null,184.96137394917071,null,null,-184.96137394917071,"LOSS",{"$f":"IF(COUNTA($F$6:$F$10)=5,(F399-F24)/F24,\"\")","v":0.83111760209678975},1,"last",null,null,null,null,null,null,null,{"$f":"IF(AND(L398=\"WIN\",L399<>\"WIN\"),SUMIF(L$24:L398,\"WIN\",K$24:K398)-SUM(W$23:W397),\"\")","v":""},{"$f":"IF(AND(L398=\"LOSS\",L399<>\"LOSS\"),SUMIF(L$24:L398,\"LOSS\",K$24:K398)-SUM(X$23:X397),\"\")","v":-184.96137394917241}]
[null,"Row 399 (376)",null,37,null,18311.176020967898,null,183.11176020967898,null,null,219.73411225161476,"WIN",{"$f":"IF(COUNTA($F$6:$F$10)=5,(F400-F24)/F24,\"\")","v":0.85309101332195136},1,"last",null,null,null,null,null,null,null,{"$f":"IF(AND(L399=\"WIN\",L400<>\"WIN\"),SUMIF(L$24:L399,\"WIN\",K$24:K399)-SUM(W$23:W398),\"\")","v":219.73411225161544},{"$f":"IF(AND(L399=\"LOSS\",L400<>\"LOSS\"),SUMIF(L$24:L399,\"LOSS\",K$24:K399)-SUM(X$23:X398),\"\")","v":""}]
[null,"Row 400 (377)",null,88,null,18530.910133219513,null,185.30910133219513,null,null,-185.30910133219513,"LOSS",{"$f":"IF(COUNTA($F$6:$F$10)=5,(F401-F24)/F24,\"\")","v":0.83456010318873197},1,"new",null,null,null,null,null,null,null,{"$f":"IF(AND(L400=\"WIN\",L401<>\"WIN\"),SUMIF(L$24:L400,\"WIN\",K$24:K400)-SUM(W$23:W399),\"\")","v":""},{"$f":"IF(AND(L400=\"LOSS\",L401<>\"LOSS\"),SUMIF(L$24:L400,\"LOSS\",K$24:K400)-SUM(X$23:X399),\"\")","v":""}]
[null,"Row 401 (378)",null,97,null,18345.60103188732,null,183.45601031887321,null,null,-183.45601031887321,"LOSS",{"$f":"IF(COUNTA($F$6:$F$10)=5,(F402-F24)/F24,\"\")","v":0.81621450215684455},2,"last",null,null,null,null,null,null,null,{"$f":"IF(AND(L401=\"WIN\",L402<>\"WIN\"),SUMIF(L$24:L401,\"WIN\",K$24:K401)-SUM(W$23:W400),\"\")","v":""},{"$f":"IF(AND(L401=\"LOSS\",L402<>\"LOSS\"),SUMIF(L$24:L401,\"LOSS\",K$24:K401)-SUM(X$23:X400),\"\")","v":-368.76511165106785}]
[null,"Row 402 (379)",null,3,null,18162.145021568445,null,181.62145021568446,null,null,217.94574025882136,"WIN",{"$f":"IF(COUNTA($F$6:$F$10)=5,(F403-F24)/F24,\"\")","v":0.83800907618272691},1,"new",null,null,null,null,null,null,null,{"$f":"IF(AND(L402=\"WIN\",L403<>\"WIN\"),SUMIF(L$24:L402,\"WIN\",K$24:K402)-SUM(W$23:W401),\"\")","v":""},{"$f":"IF(AND(L402=\"LOSS\",L403<>\"LOSS\"),SUMIF(L$24:L402,\"LOSS\",K$24:K402)-SUM(X$23:X401),\"\")","v":""}]
[null,"Row 403 (380)",null,35,null,18380.090761827269,null,183.8009076182727,null,null,220.56108914192723,"WIN",{"$f":"IF(COUNTA($F$6:$F$10)=5,(F404-F24)/F24,\"\")","v":0.86006518509691965},2,"middle",null,null,null,null,null,null,null,{"$f":"IF(AND(L403=\"WIN\",L404<>\"WIN\"),SUMIF(L$24:L403,\"WIN\",K$24:K403)-SUM(W$23:W402),\"\")","v":""},{"$f":"IF(AND(L403=\"LOSS\",L404<>\"LOSS\"),SUMIF(L$24:L403,\"LOSS\",K$24:K403)-SUM(X$23:X402),\"\")","v":""}]
[null,"Row 404 (381)",null,40,null,18600.651850969196,null,186.00651850969197,null,null,223.20782221163037,"WIN",{"$f":"IF(COUNTA($F$6:$F$10)=5,(F405-F24)/F24,\"\")","v":0.8823859673180825},3,"middle",null,null,null,null,null,null,null,{"$f":"IF(AND(L404=\"WIN\",L405<>\"WIN\"),SUMIF(L$24:L404,\"WIN\",K$24:K404)-SUM(W$23:W403),\"\")","v":""},{"$f":"IF(AND(L404=\"LOSS\",L405<>\"LOSS\"),SUMIF(L$24:L404,\"LOSS\",K$24:K404)-SUM(X$23:X403),\"\")","v":""}]
[null,"Row 405 (382)",null,46,null,18823.859673180825,null,188.23859673180826,null,null,225.8863160781699,"WIN",{"$f":"IF(COUNTA($F$6:$F$10)=5,(F406-F24)/F24,\"\")","v":0.90497459892589938},4,"last",null,null,null,null,null,null,null,{"$f":"IF(AND(L405=\"WIN\",L406<>\"WIN\"),SUMIF(L$24:L405,\"WIN\",K$24:K405)-SUM(W$23:W404),\"\")","v":887.60096769055235},{"$f":"IF(AND(L405=\"LOSS\",L406<>\"LOSS\"),SUMIF(L$24:L405,\"LOSS\",K$24:K405)-SUM(X$23:X404),\"\")","v":""}]
[null,"Row 406 (383)",null,56,null,19049.745989258994,null,190.49745989258994,null,null,-190.49745989258994,"LOSS",{"$f":"IF(COUNTA($F$6:$F$10)=5,(F407-F24)/F24,\"\")","v":0.88592485293664036},1,"new",null,null,null,null,null,null,null,{"$f":"IF(AND(L406=\"WIN\",L407<>\"WIN\"),SUMIF(L$24:L406,\"WIN\",K$24:K406)-SUM(W$23:W405),\"\")","v":""},{"$f":"IF(AND(L406=\"LOSS\",L407<>\"LOSS\"),SUMIF(L$24:L406,\"LOSS\",K$24:K406)-SUM(X$23:X405),\"\")","v":""}]
[null,"Row 407 (384)",null,67,null,18859.248529366403,null,188.59248529366403,null,null,-188.59248529366403,"LOSS",{"$f":"IF(COUNTA($F$6:$F$10)=5,(F408-F24)/F24,\"\")","v":0.86706560440727376},2,"last",null,null,null,null,null,null,null,{"$f":"IF(AND(L407=\"WIN\",L408<>\"WIN\"),SUMIF(L$24:L407,\"WIN\",K$24:K407)-SUM(W$23:W406),\"\")","v":""},{"$f":"IF(AND(L407=\"LOSS\",L408<>\"LOSS\"),SUMIF(L$24:L407,\"LOSS\",K$24:K407)-SUM(X$23:X406),\"\")","v":-379.08994518625332}]
[null,"Row 408 (385)",null,1,null,18670.656044072737,null,186.70656044072737,null,null,224.04787252887283,"WIN",{"$f":"IF(COUNTA($F$6:$F$10)=5,(F409-F24)/F24,\"\")","v":0.88947039166016106},1,"new",null,null,null,null,null,null,null,{"$f":"IF(AND(L408=\"WIN\",L409<>\"WIN\"),SUMIF(L$24:L408,\"WIN\",K$24:K408)-SUM(W$23:W407),\"\")","v":""},{"$f":"IF(AND(L408=\"LOSS\",L409<>\"LOSS\"),SUMIF(L$24:L408,\"LOSS\",K$24:K408)-SUM(X$23:X407),\"\")","v":""}]
[null,"Row 409 (386)",null,45,null,18894.703916601611,null,{"$f":"IF(COUNTBLANK($F$6:$F$10),\"\",F409*$F$7)","v":188.94703916601611},null,null,226.73644699921934,{"$f":"IF(D409=\"\",\"\",IF(D409<$F$8,\"WIN\",\"LOSS\"))","v":"WIN"},{"$f":"IF(COUNTA($F$6:$F$10)=5,(F410-F24)/F24,\"\")","v":0.91214403636008323},{"$f":"IF(L409=L408,N408+1,1)","v":2},{"$f":"IF(N409=1,IF(N410=1,\"last\",\"new\"),IF(N410=1,\"last\",\"middle\"))","v":"last"},null,null,null,null,null,null,null,{"$f":"IF(AND(L409=\"WIN\",L410<>\"WIN\"),SUMIF(L$24:L409,\"WIN\",K$24:K409)-SUM(W$23:W408),\"\")","v":450.78431952808751},{"$f":"IF(AND(L409=\"LOSS\",L410<>\"LOSS\"),SUMIF(L$24:L409,\"LOSS\",K$24:K409)-SUM(X$23:X408),\"\")","v":""}]
[null,"Row 410 (387)",null,88,null,{"$f":"IF(COUNTBLANK($F$6:$F$10),\"\",IF(D409<$F$8,(1+$F$7*$F$9)*F409-$F$10,(1-$F$7)*F409-$F$10))","v":19121.440363600832},null,191.21440363600831,null,null,{"$f":"IF(COUNTBLANK($F$6:$F$10),\"\", IF(L410=\"win\", H410*$F$9-$F$10, IF(L410=\"loss\", -H410-$F$10)))","v":-191.21440363600831},"LOSS",{"$f":"IF(COUNTA($F$6:$F$10)=5,(F411-F24)/F24,\"\")","v":0.89302259599648237},1,"new",null,null,null,null,null,null,null,{"$f":"IF(AND(L410=\"WIN\",L411<>\"WIN\"),SUMIF(L$24:L410,\"WIN\",K$24:K410)-SUM(W$23:W409),\"\")","v":""},{"$f":"IF(AND(L410=\"LOSS\",L411<>\"LOSS\"),SUMIF(L$24:L410,\"LOSS\",K$24:K410)-SUM(X$23:X409),\"\")","v":""}]
[null,"Row 411 (388)",null,57,null,18930.225959964824,null,189.30225959964824,null,null,-189.30225959964824,"LOSS",{"$f":"IF(COUNTA($F$6:$F$10)=5,(F412-F24)/F24,\"\")","v":0.87409237003651763},2,"middle",null,null,null,null,null,null,null,{"$f":"IF(AND(L411=\"WIN\",L412<>\"WIN\"),SUMIF(L$24:L411,\"WIN\",K$24:K411)-SUM(W$23:W410),\"\")","v":""},{"$f":"IF(AND(L411=\"LOSS\",L412<>\"LOSS\"),SUMIF(L$24:L411,\"LOSS\",K$24:K411)-SUM(X$23:X410),\"\")","v":""}]
[null,"Row 412 (389)",null,68,null,18740.923700365176,null,187.40923700365175,null,null,-187.40923700365175,"LOSS",{"$f":"IF(COUNTA($F$6:$F$10)=5,(F413-F24)/F24,\"\")","v":0.85535144633615234},3,"middle",null,null,null,null,null,null,null,{"$f":"IF(AND(L412=\"WIN\",L413<>\"WIN\"),SUMIF(L$24:L412,\"WIN\",K$24:K412)-SUM(W$23:W411),\"\")","v":""},{"$f":"IF(AND(L412=\"LOSS\",L413<>\"LOSS\"),SUMIF(L$24:L412,\"LOSS\",K$24:K412)-SUM(X$23:X411),\"\")","v":""}]
[null,"Row 413 (390)",null,59,null,18553.514463361524,null,185.53514463361523,null,null,-185.53514463361523,"LOSS",{"$f":"IF(COUNTA($F$6:$F$10)=5,(F414-F24)/F24,\"\")","v":0.83679793187279061},4,"last",null,null,null,null,null,null,null,{"$f":"IF(AND(L413=\"WIN\",L414<>\"WIN\"),SUMIF(L$24:L413,\"WIN\",K$24:K413)-SUM(W$23:W412),\"\")","v":""},{"$f":"IF(AND(L413=\"LOSS\",L414<>\"LOSS\"),SUMIF(L$24:L413,\"LOSS\",K$24:K413)-SUM(X$23:X412),\"\")","v":-753.46104487292178}]
[null,"Row 414 (391)",null,51,null,18367.979318727907,null,183.67979318727907,null,null,220.41575182473488,"WIN",{"$f":"IF(COUNTA($F$6:$F$10)=5,(F415-F24)/F24,\"\")","v":0.85883950705526402},1,"last",null,null,null,null,null,null,null,{"$f":"IF(AND(L414=\"WIN\",L415<>\"WIN\"),SUMIF(L$24:L414,\"WIN\",K$24:K414)-SUM(W$23:W413),\"\")","v":220.41575182473753},{"$f":"IF(AND(L414=\"LOSS\",L415<>\"LOSS\"),SUMIF(L$24:L414,\"LOSS\",K$24:K414)-SUM(X$23:X413),\"\")","v":""}]
[null,"Row 415 (392)",null,60,null,18588.39507055264,null,185.88395070552642,null,null,-185.88395070552642,"LOSS",{"$f":"IF(COUNTA($F$6:$F$10)=5,(F416-F24)/F24,\"\")","v":0.84025111198471136},1,"last",null,null,null,null,null,null,null,{"$f":"IF(AND(L415=\"WIN\",L416<>\"WIN\"),SUMIF(L$24:L415,\"WIN\",K$24:K415)-SUM(W$23:W414),\"\")","v":""},{"$f":"IF(AND(L415=\"LOSS\",L416<>\"LOSS\"),SUMIF(L$24:L415,\"LOSS\",K$24:K415)-SUM(X$23:X414),\"\")","v":-185.88395070552724}]
[null,"Row 416 (393)",null,6,null,18402.511119847113,null,184.02511119847114,null,null,220.83013343816535,"WIN",{"$f":"IF(COUNTA($F$6:$F$10)=5,(F417-F24)/F24,\"\")","v":0.86233412532852782},1,"last",null,null,null,null,null,null,null,{"$f":"IF(AND(L416=\"WIN\",L417<>\"WIN\"),SUMIF(L$24:L416,\"WIN\",K$24:K416)-SUM(W$23:W415),\"\")","v":220.83013343816856},{"$f":"IF(AND(L416=\"LOSS\",L417<>\"LOSS\"),SUMIF(L$24:L416,\"LOSS\",K$24:K416)-SUM(X$23:X415),\"\")","v":""}]
[null,"Row 417 (394)",null,90,null,18623.341253285278,null,186.23341253285278,null,null,-186.23341253285278,"LOSS",{"$f":"IF(COUNTA($F$6:$F$10)=5,(F418-F24)/F24,\"\")","v":0.84371078407524258},1,"last",null,null,null,null,null,null,null,{"$f":"IF(AND(L417=\"WIN\",L418<>\"WIN\"),SUMIF(L$24:L417,\"WIN\",K$24:K417)-SUM(W$23:W416),\"\")","v":""},{"$f":"IF(AND(L417=\"LOSS\",L418<>\"LOSS\"),SUMIF(L$24:L417,\"LOSS\",K$24:K417)-SUM(X$23:X416),\"\")","v":-186.23341253285253}]
[null,"Row 418 (395)",null,3,null,18437.107840752426,null,184.37107840752427,null,null,221.2452940890291,"WIN",{"$f":"IF(COUNTA($F$6:$F$10)=5,(F419-F24)/F24,\"\")","v":0.86583531348414544},1,"last",null,null,null,null,null,null,null,{"$f":"IF(AND(L418=\"WIN\",L419<>\"WIN\"),SUMIF(L$24:L418,\"WIN\",K$24:K418)-SUM(W$23:W417),\"\")","v":221.2452940890289},{"$f":"IF(AND(L418=\"LOSS\",L419<>\"LOSS\"),SUMIF(L$24:L418,\"LOSS\",K$24:K418)-SUM(X$23:X417),\"\")","v":""}]
[null,"Row 419 (396)",null,62,null,18658.353134841454,null,186.58353134841454,null,null,-186.58353134841454,"LOSS",{"$f":"IF(COUNTA($F$6:$F$10)=5,(F420-F24)/F24,\"\")","v":0.84717696034930412},1,"new",null,null,null,null,null,null,null,{"$f":"IF(AND(L419=\"WIN\",L420<>\"WIN\"),SUMIF(L$24:L419,\"WIN\",K$24:K419)-SUM(W$23:W418),\"\")","v":""},{"$f":"IF(AND(L419=\"LOSS\",L420<>\"LOSS\"),SUMIF(L$24:L419,\"LOSS\",K$24:K419)-SUM(X$23:X418),\"\")","v":""}]
[null,"Row 420 (397)",null,96,null,18471.769603493041,null,184.71769603493041,null,null,-184.71769603493041,"LOSS",{"$f":"IF(COUNTA($F$6:$F$10)=5,(F421-F24)/F24,\"\")","v":0.82870519074581095},2,"middle",null,null,null,null,null,null,null,{"$f":"IF(AND(L420=\"WIN\",L421<>\"WIN\"),SUMIF(L$24:L420,\"WIN\",K$24:K420)-SUM(W$23:W419),\"\")","v":""},{"$f":"IF(AND(L420=\"LOSS\",L421<>\"LOSS\"),SUMIF(L$24:L420,\"LOSS\",K$24:K420)-SUM(X$23:X419),\"\")","v":""}]
[null,"Row 421 (398)",null,96,null,18287.05190745811,null,182.8705190745811,null,null,-182.8705190745811,"LOSS",{"$f":"IF(COUNTA($F$6:$F$10)=5,(F422-F24)/F24,\"\")","v":0.81041813883835279},3,"last",null,null,null,null,null,null,null,{"$f":"IF(AND(L421=\"WIN\",L422<>\"WIN\"),SUMIF(L$24:L421,\"WIN\",K$24:K421)-SUM(W$23:W420),\"\")","v":""},{"$f":"IF(AND(L421=\"LOSS\",L422<>\"LOSS\"),SUMIF(L$24:L421,\"LOSS\",K$24:K421)-SUM(X$23:X420),\"\")","v":-554.17174645792693}]
[null,"Row 422 (399)",null,43,null,18104.181388383528,null,181.04181388383529,null,null,217.25017666060234,"WIN",{"$f":"IF(COUNTA($F$6:$F$10)=5,(F423-F24)/F24,\"\")","v":0.83214315650441317},1,"last",null,null,null,null,null,null,null,{"$f":"IF(AND(L422=\"WIN\",L423<>\"WIN\"),SUMIF(L$24:L422,\"WIN\",K$24:K422)-SUM(W$23:W421),\"\")","v":217.25017666060012},{"$f":"IF(AND(L422=\"LOSS\",L423<>\"LOSS\"),SUMIF(L$24:L422,\"LOSS\",K$24:K422)-SUM(X$23:X421),\"\")","v":""}]
[null,"Row 423 (400)",null,64,null,18321.431565044131,null,183.21431565044131,null,null,-183.21431565044131,"LOSS",{"$f":"IF(COUNTA($F$6:$F$10)=5,(F424-F24)/F24,\"\")","v":0.81382172493936888},1,"new",null,null,null,null,null,null,null,{"$f":"IF(AND(L423=\"WIN\",L424<>\"WIN\"),SUMIF(L$24:L423,\"WIN\",K$24:K423)-SUM(W$23:W422),\"\")","v":""},{"$f":"IF(AND(L423=\"LOSS\",L424<>\"LOSS\"),SUMIF(L$24:L423,\"LOSS\",K$24:K423)-SUM(X$23:X422),\"\")","v":""}]
[null,"Row 424 (401)",null,96,null,18138.217249393689,null,181.38217249393688,null,null,-181.38217249393688,"LOSS",{"$f":"IF(COUNTA($F$6:$F$10)=5,(F425-F24)/F24,\"\")","v":0.7956835076899752},2,"middle",null,null,null,null,null,null,null,{"$f":"IF(AND(L424=\"WIN\",L425<>\"WIN\"),SUMIF(L$24:L424,\"WIN\",K$24:K424)-SUM(W$23:W423),\"\")","v":""},{"$f":"IF(AND(L424=\"LOSS\",L425<>\"LOSS\"),SUMIF(L$24:L424,\"LOSS\",K$24:K424)-SUM(X$23:X423),\"\")","v":""}]
[null,"Row 425 (402)",null,60,null,17956.835076899752,null,179.56835076899753,null,null,-179.56835076899753,"LOSS",{"$f":"IF(COUNTA($F$6:$F$10)=5,(F426-F24)/F24,\"\")","v":0.77772667261307538},3,"last",null,null,null,null,null,null,null,{"$f":"IF(AND(L425=\"WIN\",L426<>\"WIN\"),SUMIF(L$24:L425,\"WIN\",K$24:K425)-SUM(W$23:W424),\"\")","v":""},{"$f":"IF(AND(L425=\"LOSS\",L426<>\"LOSS\"),SUMIF(L$24:L425,\"LOSS\",K$24:K425)-SUM(X$23:X424),\"\")","v":-544.16483891337703}]
[null,"Row 426 (403)",null,50,null,17777.266726130754,null,177.77266726130753,null,null,213.32720071356903,"WIN",{"$f":"IF(COUNTA($F$6:$F$10)=5,(F427-F24)/F24,\"\")","v":0.79905939268443216},1,"new",null,null,null,null,null,null,null,{"$f":"IF(AND(L426=\"WIN\",L427<>\"WIN\"),SUMIF(L$24:L426,\"WIN\",K$24:K426)-SUM(W$23:W425),\"\")","v":""},{"$f":"IF(AND(L426=\"LOSS\",L427<>\"LOSS\"),SUMIF(L$24:L426,\"LOSS\",K$24:K426)-SUM(X$23:X425),\"\")","v":""}]
[null,"Row 427 (404)",null,8,null,17990.593926844322,null,179.90593926844323,null,null,215.88712712213189,"WIN",{"$f":"IF(COUNTA($F$6:$F$10)=5,(F428-F24)/F24,\"\")","v":0.82064810539664546},2,"middle",null,null,null,null,null,null,null,{"$f":"IF(AND(L427=\"WIN\",L428<>\"WIN\"),SUMIF(L$24:L427,\"WIN\",K$24:K427)-SUM(W$23:W426),\"\")","v":""},{"$f":"IF(AND(L427=\"LOSS\",L428<>\"LOSS\"),SUMIF(L$24:L427,\"LOSS\",K$24:K427)-SUM(X$23:X426),\"\")","v":""}]
[null,"Row 428 (405)",null,11,null,18206.481053966454,null,182.06481053966453,null,null,218.47777264759745,"WIN",{"$f":"IF(COUNTA($F$6:$F$10)=5,(F429-F24)/F24,\"\")","v":0.84249588266140529},3,"middle",null,null,null,null,null,null,null,{"$f":"IF(AND(L428=\"WIN\",L429<>\"WIN\"),SUMIF(L$24:L428,\"WIN\",K$24:K428)-SUM(W$23:W427),\"\")","v":""},{"$f":"IF(AND(L428=\"LOSS\",L429<>\"LOSS\"),SUMIF(L$24:L428,\"LOSS\",K$24:K428)-SUM(X$23:X427),\"\")","v":""}]
[null,"Row 429 (406)",null,8,null,18424.958826614053,null,184.24958826614053,null,null,221.09950591936862,"WIN",{"$f":"IF(COUNTA($F$6:$F$10)=5,(F430-F24)/F24,\"\")","v":0.86460583325334228},4,"middle",null,null,null,null,null,null,null,{"$f":"IF(AND(L429=\"WIN\",L430<>\"WIN\"),SUMIF(L$24:L429,\"WIN\",K$24:K429)-SUM(W$23:W428),\"\")","v":""},{"$f":"IF(AND(L429=\"LOSS\",L430<>\"LOSS\"),SUMIF(L$24:L429,\"LOSS\",K$24:K429)-SUM(X$23:X428),\"\")","v":""}]
[null,"Row 430 (407)",null,52,null,18646.058332533423,null,186.46058332533423,null,null,223.75269999040106,"WIN",{"$f":"IF(COUNTA($F$6:$F$10)=5,(F431-F24)/F24,\"\")","v":0.88698110325238233},5,"middle",null,null,null,null,null,null,null,{"$f":"IF(AND(L430=\"WIN\",L431<>\"WIN\"),SUMIF(L$24:L430,\"WIN\",K$24:K430)-SUM(W$23:W429),\"\")","v":""},{"$f":"IF(AND(L430=\"LOSS\",L431<>\"LOSS\"),SUMIF(L$24:L430,\"LOSS\",K$24:K430)-SUM(X$23:X429),\"\")","v":""}]
[null,"Row 431 (408)",null,26,null,18869.811032523823,null,188.69811032523825,null,null,226.4377323902859,"WIN",{"$f":"IF(COUNTA($F$6:$F$10)=5,(F432-F24)/F24,\"\")","v":0.90962487649141077},6,"last",null,null,null,null,null,null,null,{"$f":"IF(AND(L431=\"WIN\",L432<>\"WIN\"),SUMIF(L$24:L431,\"WIN\",K$24:K431)-SUM(W$23:W430),\"\")","v":1318.9820387833461},{"$f":"IF(AND(L431=\"LOSS\",L432<>\"LOSS\"),SUMIF(L$24:L431,\"LOSS\",K$24:K431)-SUM(X$23:X430),\"\")","v":""}]
[null,"Row 432 (409)",null,84,null,19096.248764914108,null,190.96248764914108,null,null,-190.96248764914108,"LOSS",{"$f":"IF(COUNTA($F$6:$F$10)=5,(F433-F24)/F24,\"\")","v":0.89052862772649677},1,"last",null,null,null,null,null,null,null,{"$f":"IF(AND(L432=\"WIN\",L433<>\"WIN\"),SUMIF(L$24:L432,\"WIN\",K$24:K432)-SUM(W$23:W431),\"\")","v":""},{"$f":"IF(AND(L432=\"LOSS\",L433<>\"LOSS\"),SUMIF(L$24:L432,\"LOSS\",K$24:K432)-SUM(X$23:X431),\"\")","v":-190.9624876491398}]
[null,"Row 433 (410)",null,48,null,18905.286277264968,null,189.05286277264969,null,null,226.86343532717962,"WIN",{"$f":"IF(COUNTA($F$6:$F$10)=5,(F434-F24)/F24,\"\")","v":0.91321497125921491},1,"last",null,null,null,null,null,null,null,{"$f":"IF(AND(L433=\"WIN\",L434<>\"WIN\"),SUMIF(L$24:L433,\"WIN\",K$24:K433)-SUM(W$23:W432),\"\")","v":226.86343532717729},{"$f":"IF(AND(L433=\"LOSS\",L434<>\"LOSS\"),SUMIF(L$24:L433,\"LOSS\",K$24:K433)-SUM(X$23:X432),\"\")","v":""}]
[null,"Row 434 (411)",null,74,null,19132.149712592149,null,191.3214971259215,null,null,-191.3214971259215,"LOSS",{"$f":"IF(COUNTA($F$6:$F$10)=5,(F435-F24)/F24,\"\")","v":0.89408282154662266},1,"last",null,null,null,null,null,null,null,{"$f":"IF(AND(L434=\"WIN\",L435<>\"WIN\"),SUMIF(L$24:L434,\"WIN\",K$24:K434)-SUM(W$23:W433),\"\")","v":""},{"$f":"IF(AND(L434=\"LOSS\",L435<>\"LOSS\"),SUMIF(L$24:L434,\"LOSS\",K$24:K434)-SUM(X$23:X433),\"\")","v":-191.32149712592218}]
[null,"Row 435 (412)",null,39,null,18940.828215466227,null,189.40828215466226,null,null,227.28993858559471,"WIN",{"$f":"IF(COUNTA($F$6:$F$10)=5,(F436-F24)/F24,\"\")","v":0.91681181540518231},1,"last",null,null,null,null,null,null,null,{"$f":"IF(AND(L435=\"WIN\",L436<>\"WIN\"),SUMIF(L$24:L435,\"WIN\",K$24:K435)-SUM(W$23:W434),\"\")","v":227.28993858559261},{"$f":"IF(AND(L435=\"LOSS\",L436<>\"LOSS\"),SUMIF(L$24:L435,\"LOSS\",K$24:K435)-SUM(X$23:X434),\"\")","v":""}]
[null,"Row 436 (413)",null,92,null,19168.118154051823,null,191.68118154051822,null,null,-191.68118154051822,"LOSS",{"$f":"IF(COUNTA($F$6:$F$10)=5,(F437-F24)/F24,\"\")","v":0.89764369725113025},1,"last",null,null,null,null,null,null,null,{"$f":"IF(AND(L436=\"WIN\",L437<>\"WIN\"),SUMIF(L$24:L436,\"WIN\",K$24:K436)-SUM(W$23:W435),\"\")","v":""},{"$f":"IF(AND(L436=\"LOSS\",L437<>\"LOSS\"),SUMIF(L$24:L436,\"LOSS\",K$24:K436)-SUM(X$23:X435),\"\")","v":-191.6811815405199}]
[null,"Row 437 (414)",null,49,null,18976.436972511303,null,189.76436972511303,null,null,227.71724367013562,"WIN",{"$f":"IF(COUNTA($F$6:$F$10)=5,(F438-F24)/F24,\"\")","v":0.92041542161814394},1,"new",null,null,null,null,null,null,null,{"$f":"IF(AND(L437=\"WIN\",L438<>\"WIN\"),SUMIF(L$24:L437,\"WIN\",K$24:K437)-SUM(W$23:W436),\"\")","v":""},{"$f":"IF(AND(L437=\"LOSS\",L438<>\"LOSS\"),SUMIF(L$24:L437,\"LOSS\",K$24:K437)-SUM(X$23:X436),\"\")","v":""}]
[null,"Row 438 (415)",null,26,null,19204.15421618144,null,192.04154216181439,null,null,230.44985059417726,"WIN",{"$f":"IF(COUNTA($F$6:$F$10)=5,(F439-F24)/F24,\"\")","v":0.9434604066775617},2,"middle",null,null,null,null,null,null,null,{"$f":"IF(AND(L438=\"WIN\",L439<>\"WIN\"),SUMIF(L$24:L438,\"WIN\",K$24:K438)-SUM(W$23:W437),\"\")","v":""},{"$f":"IF(AND(L438=\"LOSS\",L439<>\"LOSS\"),SUMIF(L$24:L438,\"LOSS\",K$24:K438)-SUM(X$23:X437),\"\")","v":""}]
[null,"Row 439 (416)",null,20,null,19434.604066775617,null,194.34604066775617,null,null,233.21524880130738,"WIN",{"$f":"IF(COUNTA($F$6:$F$10)=5,(F440-F24)/F24,\"\")","v":0.96678193155769254},3,"last",null,null,null,null,null,null,null,{"$f":"IF(AND(L439=\"WIN\",L440<>\"WIN\"),SUMIF(L$24:L439,\"WIN\",K$24:K439)-SUM(W$23:W438),\"\")","v":691.38234306561935},{"$f":"IF(AND(L439=\"LOSS\",L440<>\"LOSS\"),SUMIF(L$24:L439,\"LOSS\",K$24:K439)-SUM(X$23:X438),\"\")","v":""}]
[null,"Row 440 (417)",null,91,null,19667.819315576926,null,196.67819315576926,null,null,-196.67819315576926,"LOSS",{"$f":"IF(COUNTA($F$6:$F$10)=5,(F441-F24)/F24,\"\")","v":0.9471141122421155},1,"last",null,null,null,null,null,null,null,{"$f":"IF(AND(L440=\"WIN\",L441<>\"WIN\"),SUMIF(L$24:L440,\"WIN\",K$24:K440)-SUM(W$23:W439),\"\")","v":""},{"$f":"IF(AND(L440=\"LOSS\",L441<>\"LOSS\"),SUMIF(L$24:L440,\"LOSS\",K$24:K440)-SUM(X$23:X439),\"\")","v":-196.67819315577071}]
[null,"Row 441 (418)",null,53,null,19471.141122421155,null,194.71141122421156,null,null,233.65369346905385,"WIN",{"$f":"IF(COUNTA($F$6:$F$10)=5,(F442-F24)/F24,\"\")","v":0.97047948158902109},1,"last",null,null,null,null,null,null,null,{"$f":"IF(AND(L441=\"WIN\",L442<>\"WIN\"),SUMIF(L$24:L441,\"WIN\",K$24:K441)-SUM(W$23:W440),\"\")","v":233.65369346905209},{"$f":"IF(AND(L441=\"LOSS\",L442<>\"LOSS\"),SUMIF(L$24:L441,\"LOSS\",K$24:K441)-SUM(X$23:X440),\"\")","v":""}]
[null,"Row 442 (419)",null,77,null,19704.794815890211,null,197.0479481589021,null,null,-197.0479481589021,"LOSS",{"$f":"IF(COUNTA($F$6:$F$10)=5,(F443-F24)/F24,\"\")","v":0.95077468677313082},1,"new",null,null,null,null,null,null,null,{"$f":"IF(AND(L442=\"WIN\",L443<>\"WIN\"),SUMIF(L$24:L442,\"WIN\",K$24:K442)-SUM(W$23:W441),\"\")","v":""},{"$f":"IF(AND(L442=\"LOSS\",L443<>\"LOSS\"),SUMIF(L$24:L442,\"LOSS\",K$24:K442)-SUM(X$23:X441),\"\")","v":""}]
[null,"Row 443 (420)",null,61,null,19507.746867731308,null,195.07746867731308,null,null,-195.07746867731308,"LOSS",{"$f":"IF(COUNTA($F$6:$F$10)=5,(F444-F24)/F24,\"\")","v":0.93126693990539933},2,"middle",null,null,null,null,null,null,null,{"$f":"IF(AND(L443=\"WIN\",L444<>\"WIN\"),SUMIF(L$24:L443,\"WIN\",K$24:K443)-SUM(W$23:W442),\"\")","v":""},{"$f":"IF(AND(L443=\"LOSS\",L444<>\"LOSS\"),SUMIF(L$24:L443,\"LOSS\",K$24:K443)-SUM(X$23:X442),\"\")","v":""}]
[null,"Row 444 (421)",null,80,null,19312.669399053993,null,193.12669399053993,null,null,-193.12669399053993,"LOSS",{"$f":"IF(COUNTA($F$6:$F$10)=5,(F445-F24)/F24,\"\")","v":0.91195427050634537},3,"middle",null,null,null,null,null,null,null,{"$f":"IF(AND(L444=\"WIN\",L445<>\"WIN\"),SUMIF(L$24:L444,\"WIN\",K$24:K444)-SUM(W$23:W443),\"\")","v":""},{"$f":"IF(AND(L444=\"LOSS\",L445<>\"LOSS\"),SUMIF(L$24:L444,\"LOSS\",K$24:K444)-SUM(X$23:X443),\"\")","v":""}]
[null,"Row 445 (422)",null,94,null,19119.542705063453,null,191.19542705063455,null,null,-191.19542705063455,"LOSS",{"$f":"IF(COUNTA($F$6:$F$10)=5,(F446-F24)/F24,\"\")","v":0.89283472780128181},4,"middle",null,null,null,null,null,null,null,{"$f":"IF(AND(L445=\"WIN\",L446<>\"WIN\"),SUMIF(L$24:L445,\"WIN\",K$24:K445)-SUM(W$23:W444),\"\")","v":""},{"$f":"IF(AND(L445=\"LOSS\",L446<>\"LOSS\"),SUMIF(L$24:L445,\"LOSS\",K$24:K445)-SUM(X$23:X444),\"\")","v":""}]
[null,"Row 446 (423)",null,71,null,18928.347278012818,null,189.28347278012819,null,null,-189.28347278012819,"LOSS",{"$f":"IF(COUNTA($F$6:$F$10)=5,(F447-F24)/F24,\"\")","v":0.87390638052326908},5,"last",null,null,null,null,null,null,null,{"$f":"IF(AND(L446=\"WIN\",L447<>\"WIN\"),SUMIF(L$24:L446,\"WIN\",K$24:K446)-SUM(W$23:W445),\"\")","v":""},{"$f":"IF(AND(L446=\"LOSS\",L447<>\"LOSS\"),SUMIF(L$24:L446,\"LOSS\",K$24:K446)-SUM(X$23:X445),\"\")","v":-965.73101065752053}]
[null,"Row 447 (424)",null,22,null,18739.06380523269,null,187.39063805232692,null,null,224.8687656627923,"WIN",{"$f":"IF(COUNTA($F$6:$F$10)=5,(F448-F24)/F24,\"\")","v":0.8963932570895482},1,"new",null,null,null,null,null,null,null,{"$f":"IF(AND(L447=\"WIN\",L448<>\"WIN\"),SUMIF(L$24:L447,\"WIN\",K$24:K447)-SUM(W$23:W446),\"\")","v":""},{"$f":"IF(AND(L447=\"LOSS\",L448<>\"LOSS\"),SUMIF(L$24:L447,\"LOSS\",K$24:K447)-SUM(X$23:X446),\"\")","v":""}]
[null,"Row 448 (425)",null,51,null,18963.932570895482,null,189.63932570895483,null,null,227.56719085074579,"WIN",{"$f":"IF(COUNTA($F$6:$F$10)=5,(F449-F24)/F24,\"\")","v":0.91914997617462291},2,"last",null,null,null,null,null,null,null,{"$f":"IF(AND(L448=\"WIN\",L449<>\"WIN\"),SUMIF(L$24:L448,\"WIN\",K$24:K448)-SUM(W$23:W447),\"\")","v":452.43595651353826},{"$f":"IF(AND(L448=\"LOSS\",L449<>\"LOSS\"),SUMIF(L$24:L448,\"LOSS\",K$24:K448)-SUM(X$23:X447),\"\")","v":""}]
[null,"Row 449 (426)",null,87,null,19191.499761746229,null,191.91499761746229,null,null,-191.91499761746229,"LOSS",{"$f":"IF(COUNTA($F$6:$F$10)=5,(F450-F24)/F24,\"\")","v":0.89995847641287652},1,"last",null,null,null,null,null,null,null,{"$f":"IF(AND(L449=\"WIN\",L450<>\"WIN\"),SUMIF(L$24:L449,\"WIN\",K$24:K449)-SUM(W$23:W448),\"\")","v":""},{"$f":"IF(AND(L449=\"LOSS\",L450<>\"LOSS\"),SUMIF(L$24:L449,\"LOSS\",K$24:K449)-SUM(X$23:X448),\"\")","v":-191.91499761746309}]
[null,"Row 450 (427)",null,24,null,18999.584764128766,null,189.99584764128767,null,null,227.99501716954521,"WIN",{"$f":"IF(COUNTA($F$6:$F$10)=5,(F451-F24)/F24,\"\")","v":0.92275797812983107},1,"new",null,null,null,null,null,null,null,{"$f":"IF(AND(L450=\"WIN\",L451<>\"WIN\"),SUMIF(L$24:L450,\"WIN\",K$24:K450)-SUM(W$23:W449),\"\")","v":""},{"$f":"IF(AND(L450=\"LOSS\",L451<>\"LOSS\"),SUMIF(L$24:L450,\"LOSS\",K$24:K450)-SUM(X$23:X449),\"\")","v":""}]
[null,"Row 451 (428)",null,14,null,19227.579781298311,null,192.27579781298311,null,null,230.73095737557972,"WIN",{"$f":"IF(COUNTA($F$6:$F$10)=5,(F452-F24)/F24,\"\")","v":0.94583107386738918},2,"middle",null,null,null,null,null,null,null,{"$f":"IF(AND(L451=\"WIN\",L452<>\"WIN\"),SUMIF(L$24:L451,\"WIN\",K$24:K451)-SUM(W$23:W450),\"\")","v":""},{"$f":"IF(AND(L451=\"LOSS\",L452<>\"LOSS\"),SUMIF(L$24:L451,\"LOSS\",K$24:K451)-SUM(X$23:X450),\"\")","v":""}]
[null,"Row 452 (429)",null,19,null,19458.310738673892,null,194.58310738673893,null,null,233.49972886408671,"WIN",{"$f":"IF(COUNTA($F$6:$F$10)=5,(F453-F24)/F24,\"\")","v":0.96918104675379801},3,"middle",null,null,null,null,null,null,null,{"$f":"IF(AND(L452=\"WIN\",L453<>\"WIN\"),SUMIF(L$24:L452,\"WIN\",K$24:K452)-SUM(W$23:W451),\"\")","v":""},{"$f":"IF(AND(L452=\"LOSS\",L453<>\"LOSS\"),SUMIF(L$24:L452,\"LOSS\",K$24:K452)-SUM(X$23:X451),\"\")","v":""}]
[null,"Row 453 (430)",null,43,null,19691.81046753798,null,196.91810467537979,null,null,236.30172561045575,"WIN",{"$f":"IF(COUNTA($F$6:$F$10)=5,(F454-F24)/F24,\"\")","v":0.99281121931484373},4,"middle",null,null,null,null,null,null,null,{"$f":"IF(AND(L453=\"WIN\",L454<>\"WIN\"),SUMIF(L$24:L453,\"WIN\",K$24:K453)-SUM(W$23:W452),\"\")","v":""},{"$f":"IF(AND(L453=\"LOSS\",L454<>\"LOSS\"),SUMIF(L$24:L453,\"LOSS\",K$24:K453)-SUM(X$23:X452),\"\")","v":""}]
[null,"Row 454 (431)",null,35,null,19928.112193148438,null,199.28112193148439,null,null,239.13734631778127,"WIN",{"$f":"IF(COUNTA($F$6:$F$10)=5,(F455-F24)/F24,\"\")","v":1.0167249539466219},5,"last",null,null,null,null,null,null,null,{"$f":"IF(AND(L454=\"WIN\",L455<>\"WIN\"),SUMIF(L$24:L454,\"WIN\",K$24:K454)-SUM(W$23:W453),\"\")","v":1167.6647753374491},{"$f":"IF(AND(L454=\"LOSS\",L455<>\"LOSS\"),SUMIF(L$24:L454,\"LOSS\",K$24:K454)-SUM(X$23:X453),\"\")","v":""}]
[null,"Row 455 (432)",null,82,null,20167.249539466218,null,201.67249539466218,null,null,-201.67249539466218,"LOSS",{"$f":"IF(COUNTA($F$6:$F$10)=5,(F456-F24)/F24,\"\")","v":0.99655770440715574},1,"new",null,null,null,null,null,null,null,{"$f":"IF(AND(L455=\"WIN\",L456<>\"WIN\"),SUMIF(L$24:L455,\"WIN\",K$24:K455)-SUM(W$23:W454),\"\")","v":""},{"$f":"IF(AND(L455=\"LOSS\",L456<>\"LOSS\"),SUMIF(L$24:L455,\"LOSS\",K$24:K455)-SUM(X$23:X454),\"\")","v":""}]
[null,"Row 456 (433)",null,66,null,19965.577044071557,null,199.65577044071557,null,null,-199.65577044071557,"LOSS",{"$f":"IF(COUNTA($F$6:$F$10)=5,(F457-F24)/F24,\"\")","v":0.97659212736308398},2,"middle",null,null,null,null,null,null,null,{"$f":"IF(AND(L456=\"WIN\",L457<>\"WIN\"),SUMIF(L$24:L456,\"WIN\",K$24:K456)-SUM(W$23:W455),\"\")","v":""},{"$f":"IF(AND(L456=\"LOSS\",L457<>\"LOSS\"),SUMIF(L$24:L456,\"LOSS\",K$24:K456)-SUM(X$23:X455),\"\")","v":""}]
[null,"Row 457 (434)",null,59,null,19765.92127363084,null,197.6592127363084,null,null,-197.6592127363084,"LOSS",{"$f":"IF(COUNTA($F$6:$F$10)=5,(F458-F24)/F24,\"\")","v":0.95682620608945324},3,"last",null,null,null,null,null,null,null,{"$f":"IF(AND(L457=\"WIN\",L458<>\"WIN\"),SUMIF(L$24:L457,\"WIN\",K$24:K457)-SUM(W$23:W456),\"\")","v":""},{"$f":"IF(AND(L457=\"LOSS\",L458<>\"LOSS\"),SUMIF(L$24:L457,\"LOSS\",K$24:K457)-SUM(X$23:X456),\"\")","v":-598.98747857168564}]
[null,"Row 458 (435)",null,23,null,19568.262060894533,null,195.68262060894534,null,null,234.81914473073439,"WIN",{"$f":"IF(COUNTA($F$6:$F$10)=5,(F459-F24)/F24,\"\")","v":0.98030812056252692},1,"last",null,null,null,null,null,null,null,{"$f":"IF(AND(L458=\"WIN\",L459<>\"WIN\"),SUMIF(L$24:L458,\"WIN\",K$24:K458)-SUM(W$23:W457),\"\")","v":234.81914473073266},{"$f":"IF(AND(L458=\"LOSS\",L459<>\"LOSS\"),SUMIF(L$24:L458,\"LOSS\",K$24:K458)-SUM(X$23:X457),\"\")","v":""}]
[null,"Row 459 (436)",null,57,null,19803.081205625269,null,198.0308120562527,null,null,-198.0308120562527,"LOSS",{"$f":"IF(COUNTA($F$6:$F$10)=5,(F460-F24)/F24,\"\")","v":0.96050503935690179},1,"new",null,null,null,null,null,null,null,{"$f":"IF(AND(L459=\"WIN\",L460<>\"WIN\"),SUMIF(L$24:L459,\"WIN\",K$24:K459)-SUM(W$23:W458),\"\")","v":""},{"$f":"IF(AND(L459=\"LOSS\",L460<>\"LOSS\"),SUMIF(L$24:L459,\"LOSS\",K$24:K459)-SUM(X$23:X458),\"\")","v":""}]
[null,"Row 460 (437)",null,90,null,19605.050393569018,null,196.05050393569019,null,null,-196.05050393569019,"LOSS",{"$f":"IF(COUNTA($F$6:$F$10)=5,(F461-F24)/F24,\"\")","v":0.94089998896333271},2,"last",null,null,null,null,null,null,null,{"$f":"IF(AND(L460=\"WIN\",L461<>\"WIN\"),SUMIF(L$24:L460,\"WIN\",K$24:K460)-SUM(W$23:W459),\"\")","v":""},{"$f":"IF(AND(L460=\"LOSS\",L461<>\"LOSS\"),SUMIF(L$24:L460,\"LOSS\",K$24:K460)-SUM(X$23:X459),\"\")","v":-394.08131599194166}]
[null,"Row 461 (438)",null,19,null,19408.999889633327,null,194.08999889633327,null,null,232.90799867559991,"WIN",{"$f":"IF(COUNTA($F$6:$F$10)=5,(F462-F24)/F24,\"\")","v":0.96419078883089282},1,"last",null,null,null,null,null,null,null,{"$f":"IF(AND(L461=\"WIN\",L462<>\"WIN\"),SUMIF(L$24:L461,\"WIN\",K$24:K461)-SUM(W$23:W460),\"\")","v":232.9079986755969},{"$f":"IF(AND(L461=\"LOSS\",L462<>\"LOSS\"),SUMIF(L$24:L461,\"LOSS\",K$24:K461)-SUM(X$23:X460),\"\")","v":""}]
[null,"Row 462 (439)",null,56,null,19641.907888308928,null,196.41907888308927,null,null,-196.41907888308927,"LOSS",{"$f":"IF(COUNTA($F$6:$F$10)=5,(F463-F24)/F24,\"\")","v":0.94454888094258382},1,"new",null,null,null,null,null,null,null,{"$f":"IF(AND(L462=\"WIN\",L463<>\"WIN\"),SUMIF(L$24:L462,\"WIN\",K$24:K462)-SUM(W$23:W461),\"\")","v":""},{"$f":"IF(AND(L462=\"LOSS\",L463<>\"LOSS\"),SUMIF(L$24:L462,\"LOSS\",K$24:K462)-SUM(X$23:X461),\"\")","v":""}]
[null,"Row 463 (440)",null,89,null,19445.488809425839,null,194.45488809425839,null,null,-194.45488809425839,"LOSS",{"$f":"IF(COUNTA($F$6:$F$10)=5,(F464-F24)/F24,\"\")","v":0.92510339213315784},2,"middle",null,null,null,null,null,null,null,{"$f":"IF(AND(L463=\"WIN\",L464<>\"WIN\"),SUMIF(L$24:L463,\"WIN\",K$24:K463)-SUM(W$23:W462),\"\")","v":""},{"$f":"IF(AND(L463=\"LOSS\",L464<>\"LOSS\"),SUMIF(L$24:L463,\"LOSS\",K$24:K463)-SUM(X$23:X462),\"\")","v":""}]
[null,"Row 464 (441)",null,93,null,19251.033921331578,null,192.51033921331577,null,null,-192.51033921331577,"LOSS",{"$f":"IF(COUNTA($F$6:$F$10)=5,(F465-F24)/F24,\"\")","v":0.90585235821182619},3,"middle",null,null,null,null,null,null,null,{"$f":"IF(AND(L464=\"WIN\",L465<>\"WIN\"),SUMIF(L$24:L464,\"WIN\",K$24:K464)-SUM(W$23:W463),\"\")","v":""},{"$f":"IF(AND(L464=\"LOSS\",L465<>\"LOSS\"),SUMIF(L$24:L464,\"LOSS\",K$24:K464)-SUM(X$23:X463),\"\")","v":""}]
[null,"Row 465 (442)",null,84,null,19058.523582118261,null,190.58523582118261,null,null,-190.58523582118261,"LOSS",{"$f":"IF(COUNTA($F$6:$F$10)=5,(F466-F24)/F24,\"\")","v":0.88679383462970796},4,"last",null,null,null,null,null,null,null,{"$f":"IF(AND(L465=\"WIN\",L466<>\"WIN\"),SUMIF(L$24:L465,\"WIN\",K$24:K465)-SUM(W$23:W464),\"\")","v":""},{"$f":"IF(AND(L465=\"LOSS\",L466<>\"LOSS\"),SUMIF(L$24:L465,\"LOSS\",K$24:K465)-SUM(X$23:X464),\"\")","v":-773.96954201184417}]
[null,"Row 466 (443)",null,1,null,18867.93834629708,null,188.6793834629708,null,null,226.41526015556497,"WIN",{"$f":"IF(COUNTA($F$6:$F$10)=5,(F467-F24)/F24,\"\")","v":0.90943536064526453},1,"new",null,null,null,null,null,null,null,{"$f":"IF(AND(L466=\"WIN\",L467<>\"WIN\"),SUMIF(L$24:L466,\"WIN\",K$24:K466)-SUM(W$23:W465),\"\")","v":""},{"$f":"IF(AND(L466=\"LOSS\",L467<>\"LOSS\"),SUMIF(L$24:L466,\"LOSS\",K$24:K466)-SUM(X$23:X465),\"\")","v":""}]
[null,"Row 467 (444)",null,51,null,19094.353606452645,null,190.94353606452646,null,null,229.13224327743174,"WIN",{"$f":"IF(COUNTA($F$6:$F$10)=5,(F468-F24)/F24,\"\")","v":0.93234858497300777},2,"middle",null,null,null,null,null,null,null,{"$f":"IF(AND(L467=\"WIN\",L468<>\"WIN\"),SUMIF(L$24:L467,\"WIN\",K$24:K467)-SUM(W$23:W466),\"\")","v":""},{"$f":"IF(AND(L467=\"LOSS\",L468<>\"LOSS\"),SUMIF(L$24:L467,\"LOSS\",K$24:K467)-SUM(X$23:X466),\"\")","v":""}]
[null,"Row 468 (445)",null,5,null,19323.485849730077,null,193.23485849730079,null,null,231.88183019676094,"WIN",{"$f":"IF(COUNTA($F$6:$F$10)=5,(F469-F24)/F24,\"\")","v":0.95553676799268394},3,"middle",null,null,null,null,null,null,null,{"$f":"IF(AND(L468=\"WIN\",L469<>\"WIN\"),SUMIF(L$24:L468,\"WIN\",K$24:K468)-SUM(W$23:W467),\"\")","v":""},{"$f":"IF(AND(L468=\"LOSS\",L469<>\"LOSS\"),SUMIF(L$24:L468,\"LOSS\",K$24:K468)-SUM(X$23:X467),\"\")","v":""}]
[null,"Row 469 (446)",null,46,null,19555.36767992684,null,195.5536767992684,null,null,234.66441215912207,"WIN",{"$f":"IF(COUNTA($F$6:$F$10)=5,(F470-F24)/F24,\"\")","v":0.97900320920859629},4,"middle",null,null,null,null,null,null,null,{"$f":"IF(AND(L469=\"WIN\",L470<>\"WIN\"),SUMIF(L$24:L469,\"WIN\",K$24:K469)-SUM(W$23:W468),\"\")","v":""},{"$f":"IF(AND(L469=\"LOSS\",L470<>\"LOSS\"),SUMIF(L$24:L469,\"LOSS\",K$24:K469)-SUM(X$23:X468),\"\")","v":""}]
[null,"Row 470 (447)",null,27,null,19790.032092085963,null,197.90032092085963,null,null,237.48038510503153,"WIN",{"$f":"IF(COUNTA($F$6:$F$10)=5,(F471-F24)/F24,\"\")","v":1.0027512477190994},5,"middle",null,null,null,null,null,null,null,{"$f":"IF(AND(L470=\"WIN\",L471<>\"WIN\"),SUMIF(L$24:L470,\"WIN\",K$24:K470)-SUM(W$23:W469),\"\")","v":""},{"$f":"IF(AND(L470=\"LOSS\",L471<>\"LOSS\"),SUMIF(L$24:L470,\"LOSS\",K$24:K470)-SUM(X$23:X469),\"\")","v":""}]
[null,"Row 471 (448)",null,8,null,20027.512477190994,null,200.27512477190996,null,null,240.33014972629195,"WIN",{"$f":"IF(COUNTA($F$6:$F$10)=5,(F472-F24)/F24,\"\")","v":1.0267842626917285},6,"middle",null,null,null,null,null,null,null,{"$f":"IF(AND(L471=\"WIN\",L472<>\"WIN\"),SUMIF(L$24:L471,\"WIN\",K$24:K471)-SUM(W$23:W470),\"\")","v":""},{"$f":"IF(AND(L471=\"LOSS\",L472<>\"LOSS\"),SUMIF(L$24:L471,\"LOSS\",K$24:K471)-SUM(X$23:X470),\"\")","v":""}]
[null,"Row 472 (449)",null,48,null,20267.842626917285,null,202.67842626917286,null,null,243.21411152300743,"WIN",{"$f":"IF(COUNTA($F$6:$F$10)=5,(F473-F24)/F24,\"\")","v":1.0511056738440292},7,"middle",null,null,null,null,null,null,null,{"$f":"IF(AND(L472=\"WIN\",L473<>\"WIN\"),SUMIF(L$24:L472,\"WIN\",K$24:K472)-SUM(W$23:W471),\"\")","v":""},{"$f":"IF(AND(L472=\"LOSS\",L473<>\"LOSS\"),SUMIF(L$24:L472,\"LOSS\",K$24:K472)-SUM(X$23:X471),\"\")","v":""}]
[null,"Row 473 (450)",null,49,null,20511.056738440293,null,{"$f":"IF(COUNTBLANK($F$6:$F$10),\"\",F473*$F$7)","v":205.11056738440294},null,null,246.13268086128352,{"$f":"IF(D473=\"\",\"\",IF(D473<$F$8,\"WIN\",\"LOSS\"))","v":"WIN"},{"$f":"IF(COUNTA($F$6:$F$10)=5,(F474-F24)/F24,\"\")","v":1.0757189419301576},{"$f":"IF(L473=L472,N472+1,1)","v":8},{"$f":"IF(N473=1,IF(N474=1,\"last\",\"new\"),IF(N474=1,\"last\",\"middle\"))","v":"last"},null,null,null,null,null,null,null,{"$f":"IF(AND(L473=\"WIN\",L474<>\"WIN\"),SUMIF(L$24:L473,\"WIN\",K$24:K473)-SUM(W$23:W472),\"\")","v":1889.251073004496},{"$f":"IF(AND(L473=\"LOSS\",L474<>\"LOSS\"),SUMIF(L$24:L473,\"LOSS\",K$24:K473)-SUM(X$23:X472),\"\")","v":""}]
[null,"Row 474 (451)",null,56,null,{"$f":"IF(COUNTBLANK($F$6:$F$10),\"\",IF(D473<$F$8,(1+$F$7*$F$9)*F473-$F$10,(1-$F$7)*F473-$F$10))","v":20757.189419301576},null,207.57189419301577,null,null,{"$f":"IF(COUNTBLANK($F$6:$F$10),\"\", IF(L474=\"win\", H474*$F$9-$F$10, IF(L474=\"loss\", -H474-$F$10)))","v":-207.57189419301577},"LOSS",{"$f":"IF(COUNTA($F$6:$F$10)=5,(F475-F24)/F24,\"\")","v":1.0549617525108559},1,"last",null,null,null,null,null,null,null,{"$f":"IF(AND(L474=\"WIN\",L475<>\"WIN\"),SUMIF(L$24:L474,\"WIN\",K$24:K474)-SUM(W$23:W473),\"\")","v":""},{"$f":"IF(AND(L474=\"LOSS\",L475<>\"LOSS\"),SUMIF(L$24:L474,\"LOSS\",K$24:K474)-SUM(X$23:X473),\"\")","v":-207.57189419301722}]
[null,"Row 475 (452)",null,16,null,20549.617525108559,null,205.49617525108559,null,null,246.59541030130271,"WIN",{"$f":"IF(COUNTA($F$6:$F$10)=5,(F476-F24)/F24,\"\")","v":1.0796212935409861},1,"last",null,null,null,null,null,null,null,{"$f":"IF(AND(L475=\"WIN\",L476<>\"WIN\"),SUMIF(L$24:L475,\"WIN\",K$24:K475)-SUM(W$23:W474),\"\")","v":246.59541030129913},{"$f":"IF(AND(L475=\"LOSS\",L476<>\"LOSS\"),SUMIF(L$24:L475,\"LOSS\",K$24:K475)-SUM(X$23:X474),\"\")","v":""}]
[null,"Row 476 (453)",null,68,null,20796.212935409862,null,207.96212935409861,null,null,-207.96212935409861,"LOSS",{"$f":"IF(COUNTA($F$6:$F$10)=5,(F477-F24)/F24,\"\")","v":1.0588250806055763},1,"new",null,null,null,null,null,null,null,{"$f":"IF(AND(L476=\"WIN\",L477<>\"WIN\"),SUMIF(L$24:L476,\"WIN\",K$24:K476)-SUM(W$23:W475),\"\")","v":""},{"$f":"IF(AND(L476=\"LOSS\",L477<>\"LOSS\"),SUMIF(L$24:L476,\"LOSS\",K$24:K476)-SUM(X$23:X475),\"\")","v":""}]
[null,"Row 477 (454)",null,60,null,20588.250806055763,null,205.88250806055763,null,null,-205.88250806055763,"LOSS",{"$f":"IF(COUNTA($F$6:$F$10)=5,(F478-F24)/F24,\"\")","v":1.0382368297995206},2,"last",null,null,null,null,null,null,null,{"$f":"IF(AND(L477=\"WIN\",L478<>\"WIN\"),SUMIF(L$24:L477,\"WIN\",K$24:K477)-SUM(W$23:W476),\"\")","v":""},{"$f":"IF(AND(L477=\"LOSS\",L478<>\"LOSS\"),SUMIF(L$24:L477,\"LOSS\",K$24:K477)-SUM(X$23:X476),\"\")","v":-413.84463741465515}]
[null,"Row 478 (455)",null,44,null,20382.368297995206,null,203.82368297995208,null,null,244.58841957594248,"WIN",{"$f":"IF(COUNTA($F$6:$F$10)=5,(F479-F24)/F24,\"\")","v":1.062695671757115},1,"new",null,null,null,null,null,null,null,{"$f":"IF(AND(L478=\"WIN\",L479<>\"WIN\"),SUMIF(L$24:L478,\"WIN\",K$24:K478)-SUM(W$23:W477),\"\")","v":""},{"$f":"IF(AND(L478=\"LOSS\",L479<>\"LOSS\"),SUMIF(L$24:L478,\"LOSS\",K$24:K478)-SUM(X$23:X477),\"\")","v":""}]
[null,"Row 479 (456)",null,8,null,20626.956717571149,null,206.2695671757115,null,null,247.5234806108538,"WIN",{"$f":"IF(COUNTA($F$6:$F$10)=5,(F480-F24)/F24,\"\")","v":1.0874480198182002},2,"middle",null,null,null,null,null,null,null,{"$f":"IF(AND(L479=\"WIN\",L480<>\"WIN\"),SUMIF(L$24:L479,\"WIN\",K$24:K479)-SUM(W$23:W478),\"\")","v":""},{"$f":"IF(AND(L479=\"LOSS\",L480<>\"LOSS\"),SUMIF(L$24:L479,\"LOSS\",K$24:K479)-SUM(X$23:X478),\"\")","v":""}]
[null,"Row 480 (457)",null,6,null,20874.480198182002,null,208.74480198182002,null,null,250.49376237818402,"WIN",{"$f":"IF(COUNTA($F$6:$F$10)=5,(F481-F24)/F24,\"\")","v":1.1124973960560187},3,"last",null,null,null,null,null,null,null,{"$f":"IF(AND(L480=\"WIN\",L481<>\"WIN\"),SUMIF(L$24:L480,\"WIN\",K$24:K480)-SUM(W$23:W479),\"\")","v":742.60566256497987},{"$f":"IF(AND(L480=\"LOSS\",L481<>\"LOSS\"),SUMIF(L$24:L480,\"LOSS\",K$24:K480)-SUM(X$23:X479),\"\")","v":""}]
[null,"Row 481 (458)",null,99,null,21124.973960560186,null,211.24973960560186,null,null,-211.24973960560186,"LOSS",{"$f":"IF(COUNTA($F$6:$F$10)=5,(F482-F24)/F24,\"\")","v":1.0913724220954584},1,"last",null,null,null,null,null,null,null,{"$f":"IF(AND(L481=\"WIN\",L482<>\"WIN\"),SUMIF(L$24:L481,\"WIN\",K$24:K481)-SUM(W$23:W480),\"\")","v":""},{"$f":"IF(AND(L481=\"LOSS\",L482<>\"LOSS\"),SUMIF(L$24:L481,\"LOSS\",K$24:K481)-SUM(X$23:X480),\"\")","v":-211.24973960560237}]
[null,"Row 482 (459)",null,16,null,20913.724220954584,null,209.13724220954583,null,null,250.96469065145499,"WIN",{"$f":"IF(COUNTA($F$6:$F$10)=5,(F483-F24)/F24,\"\")","v":1.1164688911606038},1,"new",null,null,null,null,null,null,null,{"$f":"IF(AND(L482=\"WIN\",L483<>\"WIN\"),SUMIF(L$24:L482,\"WIN\",K$24:K482)-SUM(W$23:W481),\"\")","v":""},{"$f":"IF(AND(L482=\"LOSS\",L483<>\"LOSS\"),SUMIF(L$24:L482,\"LOSS\",K$24:K482)-SUM(X$23:X481),\"\")","v":""}]
[null,"Row 483 (460)",null,46,null,21164.688911606037,null,211.64688911606038,null,null,253.97626693927245,"WIN",{"$f":"IF(COUNTA($F$6:$F$10)=5,(F484-F24)/F24,\"\")","v":1.1418665178545311},2,"middle",null,null,null,null,null,null,null,{"$f":"IF(AND(L483=\"WIN\",L484<>\"WIN\"),SUMIF(L$24:L483,\"WIN\",K$24:K483)-SUM(W$23:W482),\"\")","v":""},{"$f":"IF(AND(L483=\"LOSS\",L484<>\"LOSS\"),SUMIF(L$24:L483,\"LOSS\",K$24:K483)-SUM(X$23:X482),\"\")","v":""}]
[null,"Row 484 (461)",null,18,null,21418.66517854531,null,214.18665178545311,null,null,257.02398214254373,"WIN",{"$f":"IF(COUNTA($F$6:$F$10)=5,(F485-F24)/F24,\"\")","v":1.1675689160687857},3,"middle",null,null,null,null,null,null,null,{"$f":"IF(AND(L484=\"WIN\",L485<>\"WIN\"),SUMIF(L$24:L484,\"WIN\",K$24:K484)-SUM(W$23:W483),\"\")","v":""},{"$f":"IF(AND(L484=\"LOSS\",L485<>\"LOSS\"),SUMIF(L$24:L484,\"LOSS\",K$24:K484)-SUM(X$23:X483),\"\")","v":""}]
[null,"Row 485 (462)",null,51,null,21675.689160687856,null,216.75689160687855,null,null,260.10826992825423,"WIN",{"$f":"IF(COUNTA($F$6:$F$10)=5,(F486-F24)/F24,\"\")","v":1.1935797430616113},4,"middle",null,null,null,null,null,null,null,{"$f":"IF(AND(L485=\"WIN\",L486<>\"WIN\"),SUMIF(L$24:L485,\"WIN\",K$24:K485)-SUM(W$23:W484),\"\")","v":""},{"$f":"IF(AND(L485=\"LOSS\",L486<>\"LOSS\"),SUMIF(L$24:L485,\"LOSS\",K$24:K485)-SUM(X$23:X484),\"\")","v":""}]
[null,"Row 486 (463)",null,21,null,21935.797430616112,null,219.35797430616114,null,null,263.22956916739338,"WIN",{"$f":"IF(COUNTA($F$6:$F$10)=5,(F487-F24)/F24,\"\")","v":1.2199026999783507},5,"middle",null,null,null,null,null,null,null,{"$f":"IF(AND(L486=\"WIN\",L487<>\"WIN\"),SUMIF(L$24:L486,\"WIN\",K$24:K486)-SUM(W$23:W485),\"\")","v":""},{"$f":"IF(AND(L486=\"LOSS\",L487<>\"LOSS\"),SUMIF(L$24:L486,\"LOSS\",K$24:K486)-SUM(X$23:X485),\"\")","v":""}]
[null,"Row 487 (464)",null,30,null,22199.026999783506,null,221.99026999783507,null,null,266.3883239974021,"WIN",{"$f":"IF(COUNTA($F$6:$F$10)=5,(F488-F24)/F24,\"\")","v":1.2465415323780908},6,"middle",null,null,null,null,null,null,null,{"$f":"IF(AND(L487=\"WIN\",L488<>\"WIN\"),SUMIF(L$24:L487,\"WIN\",K$24:K487)-SUM(W$23:W486),\"\")","v":""},{"$f":"IF(AND(L487=\"LOSS\",L488<>\"LOSS\"),SUMIF(L$24:L487,\"LOSS\",K$24:K487)-SUM(X$23:X486),\"\")","v":""}]
[null,"Row 488 (465)",null,38,null,22465.415323780908,null,224.65415323780908,null,null,269.58498388537089,"WIN",{"$f":"IF(COUNTA($F$6:$F$10)=5,(F489-F24)/F24,\"\")","v":1.273500030766628},7,"last",null,null,null,null,null,null,null,{"$f":"IF(AND(L488=\"WIN\",L489<>\"WIN\"),SUMIF(L$24:L488,\"WIN\",K$24:K488)-SUM(W$23:W487),\"\")","v":1821.2760867116885},{"$f":"IF(AND(L488=\"LOSS\",L489<>\"LOSS\"),SUMIF(L$24:L488,\"LOSS\",K$24:K488)-SUM(X$23:X487),\"\")","v":""}]
[null,"Row 489 (466)",null,86,null,22735.00030766628,null,227.3500030766628,null,null,-227.3500030766628,"LOSS",{"$f":"IF(COUNTA($F$6:$F$10)=5,(F490-F24)/F24,\"\")","v":1.2507650304589617},1,"new",null,null,null,null,null,null,null,{"$f":"IF(AND(L489=\"WIN\",L490<>\"WIN\"),SUMIF(L$24:L489,\"WIN\",K$24:K489)-SUM(W$23:W488),\"\")","v":""},{"$f":"IF(AND(L489=\"LOSS\",L490<>\"LOSS\"),SUMIF(L$24:L489,\"LOSS\",K$24:K489)-SUM(X$23:X488),\"\")","v":""}]
[null,"Row 490 (467)",null,92,null,22507.650304589617,null,225.07650304589617,null,null,-225.07650304589617,"LOSS",{"$f":"IF(COUNTA($F$6:$F$10)=5,(F491-F24)/F24,\"\")","v":1.2282573801543719},2,"last",null,null,null,null,null,null,null,{"$f":"IF(AND(L490=\"WIN\",L491<>\"WIN\"),SUMIF(L$24:L490,\"WIN\",K$24:K490)-SUM(W$23:W489),\"\")","v":""},{"$f":"IF(AND(L490=\"LOSS\",L491<>\"LOSS\"),SUMIF(L$24:L490,\"LOSS\",K$24:K490)-SUM(X$23:X489),\"\")","v":-452.42650612255966}]
[null,"Row 491 (468)",null,49,null,22282.57380154372,null,222.8257380154372,null,null,267.39088561852463,"WIN",{"$f":"IF(COUNTA($F$6:$F$10)=5,(F492-F24)/F24,\"\")","v":1.2549964687162247},1,"new",null,null,null,null,null,null,null,{"$f":"IF(AND(L491=\"WIN\",L492<>\"WIN\"),SUMIF(L$24:L491,\"WIN\",K$24:K491)-SUM(W$23:W490),\"\")","v":""},{"$f":"IF(AND(L491=\"LOSS\",L492<>\"LOSS\"),SUMIF(L$24:L491,\"LOSS\",K$24:K491)-SUM(X$23:X490),\"\")","v":""}]
[null,"Row 492 (469)",null,40,null,22549.964687162246,null,225.49964687162247,null,null,270.59957624594693,"WIN",{"$f":"IF(COUNTA($F$6:$F$10)=5,(F493-F24)/F24,\"\")","v":1.2820564263408192},2,"middle",null,null,null,null,null,null,null,{"$f":"IF(AND(L492=\"WIN\",L493<>\"WIN\"),SUMIF(L$24:L492,\"WIN\",K$24:K492)-SUM(W$23:W491),\"\")","v":""},{"$f":"IF(AND(L492=\"LOSS\",L493<>\"LOSS\"),SUMIF(L$24:L492,\"LOSS\",K$24:K492)-SUM(X$23:X491),\"\")","v":""}]
[null,"Row 493 (470)",null,29,null,22820.564263408192,null,228.20564263408193,null,null,273.8467711608983,"WIN",{"$f":"IF(COUNTA($F$6:$F$10)=5,(F494-F24)/F24,\"\")","v":1.3094411034569089},3,"last",null,null,null,null,null,null,null,{"$f":"IF(AND(L493=\"WIN\",L494<>\"WIN\"),SUMIF(L$24:L493,\"WIN\",K$24:K493)-SUM(W$23:W492),\"\")","v":811.83723302536964},{"$f":"IF(AND(L493=\"LOSS\",L494<>\"LOSS\"),SUMIF(L$24:L493,\"LOSS\",K$24:K493)-SUM(X$23:X492),\"\")","v":""}]
[null,"Row 494 (471)",null,75,null,23094.41103456909,null,230.94411034569089,null,null,-230.94411034569089,"LOSS",{"$f":"IF(COUNTA($F$6:$F$10)=5,(F495-F24)/F24,\"\")","v":1.2863466924223397},1,"new",null,null,null,null,null,null,null,{"$f":"IF(AND(L494=\"WIN\",L495<>\"WIN\"),SUMIF(L$24:L494,\"WIN\",K$24:K494)-SUM(W$23:W493),\"\")","v":""},{"$f":"IF(AND(L494=\"LOSS\",L495<>\"LOSS\"),SUMIF(L$24:L494,\"LOSS\",K$24:K494)-SUM(X$23:X493),\"\")","v":""}]
[null,"Row 495 (472)",null,77,null,22863.466924223398,null,228.63466924223397,null,null,-228.63466924223397,"LOSS",{"$f":"IF(COUNTA($F$6:$F$10)=5,(F496-F24)/F24,\"\")","v":1.2634832254981163},2,"last",null,null,null,null,null,null,null,{"$f":"IF(AND(L495=\"WIN\",L496<>\"WIN\"),SUMIF(L$24:L495,\"WIN\",K$24:K495)-SUM(W$23:W494),\"\")","v":""},{"$f":"IF(AND(L495=\"LOSS\",L496<>\"LOSS\"),SUMIF(L$24:L495,\"LOSS\",K$24:K495)-SUM(X$23:X494),\"\")","v":-459.57877958792596}]
[null,"Row 496 (473)",null,9,null,22634.832254981164,null,226.34832254981166,null,null,271.61798705977395,"WIN",{"$f":"IF(COUNTA($F$6:$F$10)=5,(F497-F24)/F24,\"\")","v":1.2906450242040937},1,"new",null,null,null,null,null,null,null,{"$f":"IF(AND(L496=\"WIN\",L497<>\"WIN\"),SUMIF(L$24:L496,\"WIN\",K$24:K496)-SUM(W$23:W495),\"\")","v":""},{"$f":"IF(AND(L496=\"LOSS\",L497<>\"LOSS\"),SUMIF(L$24:L496,\"LOSS\",K$24:K496)-SUM(X$23:X495),\"\")","v":""}]
[null,"Row 497 (474)",null,2,null,22906.450242040937,null,229.06450242040938,null,null,274.87740290449125,"WIN",{"$f":"IF(COUNTA($F$6:$F$10)=5,(F498-F24)/F24,\"\")","v":1.3181327644945429},2,"middle",null,null,null,null,null,null,null,{"$f":"IF(AND(L497=\"WIN\",L498<>\"WIN\"),SUMIF(L$24:L497,\"WIN\",K$24:K497)-SUM(W$23:W496),\"\")","v":""},{"$f":"IF(AND(L497=\"LOSS\",L498<>\"LOSS\"),SUMIF(L$24:L497,\"LOSS\",K$24:K497)-SUM(X$23:X496),\"\")","v":""}]
[null,"Row 498 (475)",null,47,null,23181.327644945428,null,231.81327644945429,null,null,278.17593173934512,"WIN",{"$f":"IF(COUNTA($F$6:$F$10)=5,(F499-F24)/F24,\"\")","v":1.3459503576684773},3,"last",null,null,null,null,null,null,null,{"$f":"IF(AND(L498=\"WIN\",L499<>\"WIN\"),SUMIF(L$24:L498,\"WIN\",K$24:K498)-SUM(W$23:W497),\"\")","v":824.67132170361583},{"$f":"IF(AND(L498=\"LOSS\",L499<>\"LOSS\"),SUMIF(L$24:L498,\"LOSS\",K$24:K498)-SUM(X$23:X497),\"\")","v":""}]
[null,"Row 499 (476)",null,72,null,23459.503576684772,null,234.59503576684773,null,null,-234.59503576684773,"LOSS",{"$f":"IF(COUNTA($F$6:$F$10)=5,(F500-F24)/F24,\"\")","v":1.3224908540917923},1,"last",null,null,null,null,null,null,null,{"$f":"IF(AND(L499=\"WIN\",L500<>\"WIN\"),SUMIF(L$24:L499,\"WIN\",K$24:K499)-SUM(W$23:W498),\"\")","v":""},{"$f":"IF(AND(L499=\"LOSS\",L500<>\"LOSS\"),SUMIF(L$24:L499,\"LOSS\",K$24:K499)-SUM(X$23:X498),\"\")","v":-234.59503576684801}]
[null,"Row 500 (477)",null,53,null,23224.908540917924,null,232.24908540917926,null,null,278.69890249101508,"WIN",{"$f":"IF(COUNTA($F$6:$F$10)=5,(F501-F24)/F24,\"\")","v":1.3503607443408938},1,"last",null,null,null,null,null,null,null,{"$f":"IF(AND(L500=\"WIN\",L501<>\"WIN\"),SUMIF(L$24:L500,\"WIN\",K$24:K500)-SUM(W$23:W499),\"\")","v":278.69890249101445},{"$f":"IF(AND(L500=\"LOSS\",L501<>\"LOSS\"),SUMIF(L$24:L500,\"LOSS\",K$24:K500)-SUM(X$23:X499),\"\")","v":""}]
[null,"Row 501 (478)",null,59,null,23503.607443408939,null,235.03607443408939,null,null,-235.03607443408939,"LOSS",{"$f":"IF(COUNTA($F$6:$F$10)=5,(F502-F24)/F24,\"\")","v":1.3268571368974849},1,"last",null,null,null,null,null,null,null,{"$f":"IF(AND(L501=\"WIN\",L502<>\"WIN\"),SUMIF(L$24:L501,\"WIN\",K$24:K501)-SUM(W$23:W500),\"\")","v":""},{"$f":"IF(AND(L501=\"LOSS\",L502<>\"LOSS\"),SUMIF(L$24:L501,\"LOSS\",K$24:K501)-SUM(X$23:X500),\"\")","v":-235.03607443408691}]
[null,"Row 502 (479)",null,34,null,23268.571368974848,null,232.6857136897485,null,null,279.22285642769816,"WIN",{"$f":"IF(COUNTA($F$6:$F$10)=5,(F503-F24)/F24,\"\")","v":1.3547794225402547},1,"new",null,null,null,null,null,null,null,{"$f":"IF(AND(L502=\"WIN\",L503<>\"WIN\"),SUMIF(L$24:L502,\"WIN\",K$24:K502)-SUM(W$23:W501),\"\")","v":""},{"$f":"IF(AND(L502=\"LOSS\",L503<>\"LOSS\"),SUMIF(L$24:L502,\"LOSS\",K$24:K502)-SUM(X$23:X501),\"\")","v":""}]
[null,"Row 503 (480)",null,30,null,23547.794225402547,null,235.47794225402549,null,null,282.5735307048306,"WIN",{"$f":"IF(COUNTA($F$6:$F$10)=5,(F504-F24)/F24,\"\")","v":1.3830367756107378},2,"middle",null,null,null,null,null,null,null,{"$f":"IF(AND(L503=\"WIN\",L504<>\"WIN\"),SUMIF(L$24:L503,\"WIN\",K$24:K503)-SUM(W$23:W502),\"\")","v":""},{"$f":"IF(AND(L503=\"LOSS\",L504<>\"LOSS\"),SUMIF(L$24:L503,\"LOSS\",K$24:K503)-SUM(X$23:X502),\"\")","v":""}]
[null,"Row 504 (481)",null,22,null,23830.367756107378,null,238.30367756107378,null,null,285.96441307328854,"WIN",{"$f":"IF(COUNTA($F$6:$F$10)=5,(F505-F24)/F24,\"\")","v":1.4116332169180668},3,"middle",null,null,null,null,null,null,null,{"$f":"IF(AND(L504=\"WIN\",L505<>\"WIN\"),SUMIF(L$24:L504,\"WIN\",K$24:K504)-SUM(W$23:W503),\"\")","v":""},{"$f":"IF(AND(L504=\"LOSS\",L505<>\"LOSS\"),SUMIF(L$24:L504,\"LOSS\",K$24:K504)-SUM(X$23:X503),\"\")","v":""}]
[null,"Row 505 (482)",null,45,null,24116.332169180667,null,241.16332169180669,null,null,289.39598603016799,"WIN",{"$f":"IF(COUNTA($F$6:$F$10)=5,(F506-F24)/F24,\"\")","v":1.4405728155210835},4,"last",null,null,null,null,null,null,null,{"$f":"IF(AND(L505=\"WIN\",L506<>\"WIN\"),SUMIF(L$24:L505,\"WIN\",K$24:K505)-SUM(W$23:W504),\"\")","v":1137.1567862359807},{"$f":"IF(AND(L505=\"LOSS\",L506<>\"LOSS\"),SUMIF(L$24:L505,\"LOSS\",K$24:K505)-SUM(X$23:X504),\"\")","v":""}]
[null,"Row 506 (483)",null,87,null,24405.728155210836,null,244.05728155210838,null,null,-244.05728155210838,"LOSS",{"$f":"IF(COUNTA($F$6:$F$10)=5,(F507-F24)/F24,\"\")","v":1.4161670873658727},1,"new",null,null,null,null,null,null,null,{"$f":"IF(AND(L506=\"WIN\",L507<>\"WIN\"),SUMIF(L$24:L506,\"WIN\",K$24:K506)-SUM(W$23:W505),\"\")","v":""},{"$f":"IF(AND(L506=\"LOSS\",L507<>\"LOSS\"),SUMIF(L$24:L506,\"LOSS\",K$24:K506)-SUM(X$23:X505),\"\")","v":""}]
[null,"Row 507 (484)",null,98,null,24161.670873658728,null,241.61670873658727,null,null,-241.61670873658727,"LOSS",{"$f":"IF(COUNTA($F$6:$F$10)=5,(F508-F24)/F24,\"\")","v":1.3920054164922142},2,"last",null,null,null,null,null,null,null,{"$f":"IF(AND(L507=\"WIN\",L508<>\"WIN\"),SUMIF(L$24:L507,\"WIN\",K$24:K507)-SUM(W$23:W506),\"\")","v":""},{"$f":"IF(AND(L507=\"LOSS\",L508<>\"LOSS\"),SUMIF(L$24:L507,\"LOSS\",K$24:K507)-SUM(X$23:X506),\"\")","v":-485.67399028869841}]
[null,"Row 508 (485)",null,46,null,23920.054164922141,null,239.20054164922141,null,null,287.04064997906568,"WIN",{"$f":"IF(COUNTA($F$6:$F$10)=5,(F509-F24)/F24,\"\")","v":1.4207094814901207},1,"new",null,null,null,null,null,null,null,{"$f":"IF(AND(L508=\"WIN\",L509<>\"WIN\"),SUMIF(L$24:L508,\"WIN\",K$24:K508)-SUM(W$23:W507),\"\")","v":""},{"$f":"IF(AND(L508=\"LOSS\",L509<>\"LOSS\"),SUMIF(L$24:L508,\"LOSS\",K$24:K508)-SUM(X$23:X507),\"\")","v":""}]
[null,"Row 509 (486)",null,48,null,24207.094814901207,null,242.07094814901208,null,null,290.48513777881448,"WIN",{"$f":"IF(COUNTA($F$6:$F$10)=5,(F510-F24)/F24,\"\")","v":1.4497579952680022},2,"middle",null,null,null,null,null,null,null,{"$f":"IF(AND(L509=\"WIN\",L510<>\"WIN\"),SUMIF(L$24:L509,\"WIN\",K$24:K509)-SUM(W$23:W508),\"\")","v":""},{"$f":"IF(AND(L509=\"LOSS\",L510<>\"LOSS\"),SUMIF(L$24:L509,\"LOSS\",K$24:K509)-SUM(X$23:X508),\"\")","v":""}]
[null,"Row 510 (487)",null,30,null,24497.579952680022,null,244.97579952680022,null,null,293.97095943216027,"WIN",{"$f":"IF(COUNTA($F$6:$F$10)=5,(F511-F24)/F24,\"\")","v":1.4791550912112184},3,"last",null,null,null,null,null,null,null,{"$f":"IF(AND(L510=\"WIN\",L511<>\"WIN\"),SUMIF(L$24:L510,\"WIN\",K$24:K510)-SUM(W$23:W509),\"\")","v":871.49674719003815},{"$f":"IF(AND(L510=\"LOSS\",L511<>\"LOSS\"),SUMIF(L$24:L510,\"LOSS\",K$24:K510)-SUM(X$23:X509),\"\")","v":""}]
[null,"Row 511 (488)",null,84,null,24791.550912112183,null,247.91550912112183,null,null,-247.91550912112183,"LOSS",{"$f":"IF(COUNTA($F$6:$F$10)=5,(F512-F24)/F24,\"\")","v":1.4543635402991062},1,"last",null,null,null,null,null,null,null,{"$f":"IF(AND(L511=\"WIN\",L512<>\"WIN\"),SUMIF(L$24:L511,\"WIN\",K$24:K511)-SUM(W$23:W510),\"\")","v":""},{"$f":"IF(AND(L511=\"LOSS\",L512<>\"LOSS\"),SUMIF(L$24:L511,\"LOSS\",K$24:K511)-SUM(X$23:X510),\"\")","v":-247.91550912112143}]
[null,"Row 512 (489)",null,14,null,24543.635402991062,null,245.43635402991063,null,null,294.52362483589275,"WIN",{"$f":"IF(COUNTA($F$6:$F$10)=5,(F513-F24)/F24,\"\")","v":1.4838159027826954},1,"last",null,null,null,null,null,null,null,{"$f":"IF(AND(L512=\"WIN\",L513<>\"WIN\"),SUMIF(L$24:L512,\"WIN\",K$24:K512)-SUM(W$23:W511),\"\")","v":294.52362483589241},{"$f":"IF(AND(L512=\"LOSS\",L513<>\"LOSS\"),SUMIF(L$24:L512,\"LOSS\",K$24:K512)-SUM(X$23:X511),\"\")","v":""}]
[null,"Row 513 (490)",null,58,null,24838.159027826954,null,248.38159027826956,null,null,-248.38159027826956,"LOSS",{"$f":"IF(COUNTA($F$6:$F$10)=5,(F514-F24)/F24,\"\")","v":1.4589777437548683},1,"last",null,null,null,null,null,null,null,{"$f":"IF(AND(L513=\"WIN\",L514<>\"WIN\"),SUMIF(L$24:L513,\"WIN\",K$24:K513)-SUM(W$23:W512),\"\")","v":""},{"$f":"IF(AND(L513=\"LOSS\",L514<>\"LOSS\"),SUMIF(L$24:L513,\"LOSS\",K$24:K513)-SUM(X$23:X512),\"\")","v":-248.38159027826623}]
[null,"Row 514 (491)",null,37,null,24589.777437548684,null,245.89777437548685,null,null,295.07732925058423,"WIN",{"$f":"IF(COUNTA($F$6:$F$10)=5,(F515-F24)/F24,\"\")","v":1.4884854766799267},1,"last",null,null,null,null,null,null,null,{"$f":"IF(AND(L514=\"WIN\",L515<>\"WIN\"),SUMIF(L$24:L514,\"WIN\",K$24:K514)-SUM(W$23:W513),\"\")","v":295.07732925058372},{"$f":"IF(AND(L514=\"LOSS\",L515<>\"LOSS\"),SUMIF(L$24:L514,\"LOSS\",K$24:K514)-SUM(X$23:X513),\"\")","v":""}]
[null,"Row 515 (492)",null,93,null,24884.854766799268,null,248.84854766799268,null,null,-248.84854766799268,"LOSS",{"$f":"IF(COUNTA($F$6:$F$10)=5,(F516-F24)/F24,\"\")","v":1.4636006219131275},1,"new",null,null,null,null,null,null,null,{"$f":"IF(AND(L515=\"WIN\",L516<>\"WIN\"),SUMIF(L$24:L515,\"WIN\",K$24:K515)-SUM(W$23:W514),\"\")","v":""},{"$f":"IF(AND(L515=\"LOSS\",L516<>\"LOSS\"),SUMIF(L$24:L515,\"LOSS\",K$24:K515)-SUM(X$23:X514),\"\")","v":""}]
[null,"Row 516 (493)",null,57,null,24636.006219131275,null,246.36006219131275,null,null,-246.36006219131275,"LOSS",{"$f":"IF(COUNTA($F$6:$F$10)=5,(F517-F24)/F24,\"\")","v":1.4389646156939961},2,"middle",null,null,null,null,null,null,null,{"$f":"IF(AND(L516=\"WIN\",L517<>\"WIN\"),SUMIF(L$24:L516,\"WIN\",K$24:K516)-SUM(W$23:W515),\"\")","v":""},{"$f":"IF(AND(L516=\"LOSS\",L517<>\"LOSS\"),SUMIF(L$24:L516,\"LOSS\",K$24:K516)-SUM(X$23:X515),\"\")","v":""}]
[null,"Row 517 (494)",null,56,null,24389.646156939962,null,243.89646156939963,null,null,-243.89646156939963,"LOSS",{"$f":"IF(COUNTA($F$6:$F$10)=5,(F518-F24)/F24,\"\")","v":1.4145749695370564},3,"middle",null,null,null,null,null,null,null,{"$f":"IF(AND(L517=\"WIN\",L518<>\"WIN\"),SUMIF(L$24:L517,\"WIN\",K$24:K517)-SUM(W$23:W516),\"\")","v":""},{"$f":"IF(AND(L517=\"LOSS\",L518<>\"LOSS\"),SUMIF(L$24:L517,\"LOSS\",K$24:K517)-SUM(X$23:X516),\"\")","v":""}]
[null,"Row 518 (495)",null,94,null,24145.749695370563,null,241.45749695370563,null,null,-241.45749695370563,"LOSS",{"$f":"IF(COUNTA($F$6:$F$10)=5,(F519-F24)/F24,\"\")","v":1.3904292198416857},4,"last",null,null,null,null,null,null,null,{"$f":"IF(AND(L518=\"WIN\",L519<>\"WIN\"),SUMIF(L$24:L518,\"WIN\",K$24:K518)-SUM(W$23:W517),\"\")","v":""},{"$f":"IF(AND(L518=\"LOSS\",L519<>\"LOSS\"),SUMIF(L$24:L518,\"LOSS\",K$24:K518)-SUM(X$23:X517),\"\")","v":-980.56256838241097}]
[null,"Row 519 (496)",null,25,null,23904.292198416857,null,239.04292198416857,null,null,286.85150638100225,"WIN",{"$f":"IF(COUNTA($F$6:$F$10)=5,(F520-F24)/F24,\"\")","v":1.4191143704797857},1,"last",null,null,null,null,null,null,null,{"$f":"IF(AND(L519=\"WIN\",L520<>\"WIN\"),SUMIF(L$24:L519,\"WIN\",K$24:K519)-SUM(W$23:W518),\"\")","v":286.85150638100458},{"$f":"IF(AND(L519=\"LOSS\",L520<>\"LOSS\"),SUMIF(L$24:L519,\"LOSS\",K$24:K519)-SUM(X$23:X518),\"\")","v":""}]
[null,"Row 520 (497)",null,64,null,24191.143704797858,null,241.91143704797858,null,null,-241.91143704797858,"LOSS",{"$f":"IF(COUNTA($F$6:$F$10)=5,(F521-F24)/F24,\"\")","v":1.3949232267749878},1,"last",null,null,null,null,null,null,null,{"$f":"IF(AND(L520=\"WIN\",L521<>\"WIN\"),SUMIF(L$24:L520,\"WIN\",K$24:K520)-SUM(W$23:W519),\"\")","v":""},{"$f":"IF(AND(L520=\"LOSS\",L521<>\"LOSS\"),SUMIF(L$24:L520,\"LOSS\",K$24:K520)-SUM(X$23:X519),\"\")","v":-241.91143704798014}]
[null,"Row 521 (498)",null,47,null,23949.232267749878,null,239.49232267749878,null,null,287.39078721299853,"WIN",{"$f":"IF(COUNTA($F$6:$F$10)=5,(F522-F24)/F24,\"\")","v":1.4236623054962878},1,"new",null,null,null,null,null,null,null,{"$f":"IF(AND(L521=\"WIN\",L522<>\"WIN\"),SUMIF(L$24:L521,\"WIN\",K$24:K521)-SUM(W$23:W520),\"\")","v":""},{"$f":"IF(AND(L521=\"LOSS\",L522<>\"LOSS\"),SUMIF(L$24:L521,\"LOSS\",K$24:K521)-SUM(X$23:X520),\"\")","v":""}]
[null,"Row 522 (499)",null,14,null,24236.623054962878,null,242.3662305496288,null,null,290.83947665955452,"WIN",{"$f":"IF(COUNTA($F$6:$F$10)=5,(F523-F24)/F24,\"\")","v":1.4527462531622435},2,"middle",null,null,null,null,null,null,null,{"$f":"IF(AND(L522=\"WIN\",L523<>\"WIN\"),SUMIF(L$24:L522,\"WIN\",K$24:K522)-SUM(W$23:W521),\"\")","v":""},{"$f":"IF(AND(L522=\"LOSS\",L523<>\"LOSS\"),SUMIF(L$24:L522,\"LOSS\",K$24:K522)-SUM(X$23:X521),\"\")","v":""}]
[null,"Row 523 (500)",null,4,null,24527.462531622434,null,245.27462531622433,null,null,294.3295503794692,"WIN",{"$f":"IF(COUNTA($F$6:$F$10)=5,(F524-F24)/F24,\"\")","v":1.4821792082001903},3,"middle",null,null,null,null,null,null,null,{"$f":"IF(AND(L523=\"WIN\",M524<>\"WIN\"),SUMIF(L$24:L523,\"WIN\",K$24:K523)-SUM(W$23:W522),\"\")","v":872.55981425202481},{"$f":"IF(AND(L523=\"LOSS\",M524<>\"LOSS\"),SUMIF(L$24:L523,\"LOSS\",K$24:K523)-SUM(X$23:X522),\"\")","v":""}]
[null,null,null,null,null,{"$f":"IF(COUNTBLANK($F$6:$F$10),\"\",IF(D523<$F$8,(1+$F$7*$F$9)*F523-$F$10,(1-$F$7)*F523-$F$10))","v":24821.792082001903}]

{"sheet":"Instruction & Quotations","index":2,"n_rows":59,"n_cols":25,"rows_kept":59,"cut":false,"hidden":false,"merged":[[1,24,1,28],[1,18,1,23],[53,19,54,26],[55,19,55,26],[45,19,45,26],[46,19,48,26],[49,19,50,26],[52,19,52,26],[1,3,1,10],[1,12,1,15],[51,3,51,15],[52,3,56,15],[4,1,58,1],[4,2,60,2],[56,19,56,23],[57,19,57,26],[4,28,58,28],[4,17,58,17],[4,12,6,15],[41,12,42,15],[57,3,57,15],[58,3,58,15]]}
[]
[null,null,null,"Quotations",null,null,null,null,null,null,null,null,"Start Up Page",null,null,null,null,null,"Instructions - How To",null,null,null,null,null,"DayTradingLife.com"]
[]
[]
[null,null,null,"\"In Order To Win, You Must Expect To Win.\"",null,null,null,null,null,null,null,null,"For More Quotations, Please Visit: www.DayTradingLife.com"]
[null,null,null,"Richard Bach (1936-, American Author)"]
[]
[null,null,null,"Expect Victory And You Make Victory."]
[null,null,null,"Preston Bradley"]
[]
[null,null,null,"\"Life... It Tends To Respond To Our Outlook, To Shape"]
[null,null,null,"Itself To Meet Our Expectations.\""]
[null,null,null,"Richard M. DeVos"]
[null,null,null,"(1926-, American Businessman, Co-Founder Of Amway Corp.)"]
[]
[null,null,null,"\"Good Is Not Good, When Better Is Expected.\""]
[null,null,null,"Thomas Fuller (1608-1661, British Clergyman, Author)"]
[]
[null,null,null,"\"Persistent Prophecy Is A Familiar Way Of Assuring The Event.\""]
[null,null,null,"George Robert Gissing (1857-1903, British Novelist, Critic, Essayist)"]
[]
[null,null,null,"\"I Skate To Where The Puck Is Going To Be, Not Where It Is.\""]
[null,null,null,"Wayne Gretzky (1961-, Canadian Hockey Player)"]
[]
[null,null,null,"\"Life Is Largely A Matter Of Expectation.\""]
[null,null,null,"Horace (BC 65-8, Italian Poet)"]
[]
[null,null,null,"\"When You Expect Things To Happen -- Strangely Enough -- They Do Happen.\""]
[null,null,null,"John Pierpont Morgan (1837-1913, American Banker, Financier, Art Collector)"]
[]
[null,null,null,"\"What Is Destructive Is Impatience, Haste, Expecting Too Much Too Fast.\""]
[null,null,null,"May Sarton (1912-1995, American Poet, Novelist)"]
[]
[null,null,null,"\"Winner Expects To Win In Advance. Life Is A Self-Fulfilling Prophesy.\""]
[null,null,null,"Author Unknown"]
[]
[null,null,null,"\"Whatever We Expect With Confidence Becomes Our Own Self-Fulfilling Prophecy.\""]
[null,null,null,"Brian Tracy (1944-, Canadian-born American Trainer, Speaker, Author, Businessman)"]
[null,null,null,"Author's Website: www.briantracy.com"]
[]
[null,null,null,"\"Expect The Best, Plan For The Worst, And Prepare To Be Surprised.\""]
[null,null,null,"Denis Waitley (1933-, American Author, Speaker, Trainer, Peak Performance Expert)",null,null,null,null,null,null,null,null,"Click Start To Start :-)"]
[null,null,null,"Author's Website: www.deniswaitley.com"]
[]
[]
[null,null,null,"\"I Know Not Anything More Pleasant, Or More Instructive, Than To Compare",null,null,null,null,null,null,null,null,null,null,null,null,null,null,null,"Van Tharp's Expectancy "]
[null,null,null,"Experience With Expectation, Or To  Register From Time To Time The ",null,null,null,null,null,null,null,null,null,null,null,null,null,null,null,"Long Version: Expectancy? It Is Your Average Win Rate * Average Amount Won – Average Loss Rate * Average Amount Lost = Expectancy, Or; Your Average Expected Profit (Or Loss) Per Trade Taken."]
[null,null,null,"Difference Between Idea And Reality. It Is By This Kind Of Observation "]
[null,null,null,"That We  Grow Daily Less Liable To Be Disappointed.\""]
[null,null,null,"Samuel Johnson (1709-1784, British author)",null,null,null,null,null,null,null,null,null,null,null,null,null,null,null," Short Version: \"Expectancy Is Simply The Mean Or Average R-Multiple Generated.\""]
[]
[null,null,null,"EXPECTANCY"]
[null,null,null,"\"In The Real World Of Investing Or Trading, Expectancy Tells You The Net Profit Or Loss That You Can Expect Over A Large Number Of Single-Unit Trades. If The Total Amount Of Losing Trades Is Greater Than The Total Amount Of Winning Trades, Then You Are A Net Loser & Have A Negative Expectancy. If The Total Amount Of Winning Trades Is Greater Than The Total Amount Of Losing Trades, Then You Are A Net Winner & Have A Positive Expectancy.\"",null,null,null,null,null,null,null,null,null,null,null,null,null,null,null,"Distribution and Reprint Policy"]
[null,null,null,null,null,null,null,null,null,null,null,null,null,null,null,null,null,null,null,"This document maybe be republished & distributed under the proviso that it cannot be altered or amended In Anyway."]
[]
[null,null,null,null,null,null,null,null,null,null,null,null,null,null,null,null,null,null,null,"DayTradingLife.com Reserve all rights to this effect. "]
[null,null,null,null,null,null,null,null,null,null,null,null,null,null,null,null,null,null,null,"For any futher information please email me at: ",null,null,null,null,"traderdowboy@gmail.com"]
[null,null,null,"Dr. Van Tharp (Page 135 - Trade Your Way To Financial Freedom).",null,null,null,null,null,null,null,null,null,null,null,null,null,null,null,"Copyright © 2011-2012 - DayTradingLife.com. - All rights reserved."]
[null,null,null,"\"A Must Read, A Timeless Classic, By The 'Position Sizing' Master.\" - Dow-Boy"]

{"sheet":"Credits","index":3,"n_rows":0,"n_cols":0,"rows_kept":0,"cut":false,"hidden":false,"merged":[]}